BDBM50355508 CHEMBL1910310
SMILES: Cc1cc(Cn2cc(CN(C3CC3)C(=O)[C@H]3CNCC[C@]3(O)c3ccc(F)c(F)c3)c3c(F)cccc23)no1
InChI Key: InChIKey=LONGBUKARLUIMU-MNNSJKJDSA-N
Data: 1 KI  2 IC50
Activity Spreadsheet -- Enzyme Inhibition Constant Data from BindingDB
Found 3 hits for monomerid = 50355508
Trg + Lig
Ki
nM
ΔG°
kcal/mole
IC50
nM
Kd
nM
EC50/IC50
nM
koff
s-1
kon
M-1s-1
pHTemp
°C
Potassium voltage-gated channel subfamily H member 2
(Homo sapiens (Human))
BDBM50355508
(CHEMBL1910310)
Show SMILES Cc1cc(Cn2cc(CN(C3CC3)C(=O)[C@H]3CNCC[C@]3(O)c3ccc(F)c(F)c3)c3c(F)cccc23)no1 |r|
Show InChI InChI=1S/C29H29F3N4O3/c1-17-11-20(34-39-17)16-35-14-18(27-24(31)3-2-4-26(27)35)15-36(21-6-7-21)28(37)22-13-33-10-9-29(22,38)19-5-8-23(30)25(32)12-19/h2-5,8,11-12,14,21-22,33,38H,6-7,9-10,13,15-16H2,1H3/t22-,29+/m1/s1
Reactome pathway
880n/an/an/an/an/an/an/an/a
Merck Frosst Centre for Therapeutic Research
Curated by ChEMBL
Assay Description
Binding affinity to human ERG
Bioorg Med Chem Lett 21: 3976-81 (2011)
Article DOI: 10.1016/j.bmcl.2011.05.014
BindingDB Entry DOI: 10.7270/Q21N81HN
Renin
(Homo sapiens (Human))
BDBM50355508
(CHEMBL1910310)
Show SMILES Cc1cc(Cn2cc(CN(C3CC3)C(=O)[C@H]3CNCC[C@]3(O)c3ccc(F)c(F)c3)c3c(F)cccc23)no1 |r|
Show InChI InChI=1S/C29H29F3N4O3/c1-17-11-20(34-39-17)16-35-14-18(27-24(31)3-2-4-26(27)35)15-36(21-6-7-21)28(37)22-13-33-10-9-29(22,38)19-5-8-23(30)25(32)12-19/h2-5,8,11-12,14,21-22,33,38H,6-7,9-10,13,15-16H2,1H3/t22-,29+/m1/s1
Reactome pathway
n/an/a 0.360n/an/an/an/an/an/a
Merck Frosst Centre for Therapeutic Research
Curated by ChEMBL
Assay Description
Inhibition of human recombinant renin using DNP-Lys-His-Pro-Phe-His-Leu-Val-Ile-His-D,L-Amp as Q-FRET substrate after 3 hrs by fluorescence assay
Bioorg Med Chem Lett 21: 3976-81 (2011)
Article DOI: 10.1016/j.bmcl.2011.05.014
BindingDB Entry DOI: 10.7270/Q21N81HN
Renin
(Homo sapiens (Human))
BDBM50355508
(CHEMBL1910310)
Show SMILES Cc1cc(Cn2cc(CN(C3CC3)C(=O)[C@H]3CNCC[C@]3(O)c3ccc(F)c(F)c3)c3c(F)cccc23)no1 |r|
Show InChI InChI=1S/C29H29F3N4O3/c1-17-11-20(34-39-17)16-35-14-18(27-24(31)3-2-4-26(27)35)15-36(21-6-7-21)28(37)22-13-33-10-9-29(22,38)19-5-8-23(30)25(32)12-19/h2-5,8,11-12,14,21-22,33,38H,6-7,9-10,13,15-16H2,1H3/t22-,29+/m1/s1
Reactome pathway
n/an/a 11n/an/an/an/an/an/a
Merck Frosst Centre for Therapeutic Research
Curated by ChEMBL
Assay Description
Inhibition of human recombinant renin in human plasma using QXL520-Lys-His-Pro-Phe-His-Leu-Val-Ile-His-Lys-(5-FAM) as Q-FRET substrate after 1 hr by ...
Bioorg Med Chem Lett 21: 3976-81 (2011)
Article DOI: 10.1016/j.bmcl.2011.05.014
BindingDB Entry DOI: 10.7270/Q21N81HN