BDBM50355589 CHEMBL1910598
SMILES: NC(=N)N\N=C/c1c(nc2sccn12)-c1ccccc1F
InChI Key: InChIKey=RABMNKPKFQQDQF-IDUWFGFVSA-N
Data: 2 IC50
Activity Spreadsheet -- Enzyme Inhibition Constant Data from BindingDB
Found 2 hits for monomerid = 50355589
Trg + Lig
Ki
nM
ΔG°
kcal/mole
IC50
nM
Kd
nM
EC50/IC50
nM
koff
s-1
kon
M-1s-1
pHTemp
°C
Serine/threonine-protein kinase Chk2
(Homo sapiens (Human))
BDBM50355589
(CHEMBL1910598)
Show SMILES NC(=N)N\N=C/c1c(nc2sccn12)-c1ccccc1F
Show InChI InChI=1S/C13H11FN6S/c14-9-4-2-1-3-8(9)11-10(7-17-19-12(15)16)20-5-6-21-13(20)18-11/h1-7H,(H4,15,16,19)/b17-7-
n/an/a>1.00E+5n/an/an/an/an/an/a
Universit£ di Bologna
Curated by ChEMBL
Assay Description
Inhibition of CHK2 assessed as inhibition of substrate phosphorylation using fluorescent peptide substrate by microplate reader assay
Eur J Med Chem 46: 4311-23 (2011)
Article DOI: 10.1016/j.ejmech.2011.07.001
BindingDB Entry DOI: 10.7270/Q2NG4R1D
Ribosomal protein S6 kinase alpha-3
(Homo sapiens (Human))
BDBM50355589
(CHEMBL1910598)
Show SMILES NC(=N)N\N=C/c1c(nc2sccn12)-c1ccccc1F
Show InChI InChI=1S/C13H11FN6S/c14-9-4-2-1-3-8(9)11-10(7-17-19-12(15)16)20-5-6-21-13(20)18-11/h1-7H,(H4,15,16,19)/b17-7-
Reactome pathway
n/an/a>1.00E+5n/an/an/an/an/an/a
Universit£ di Bologna
Curated by ChEMBL
Assay Description
Inhibition of RSK2 assessed as inhibition of substrate phosphorylation using fluorescent peptide substrate by microplate reader assay
Eur J Med Chem 46: 4311-23 (2011)
Article DOI: 10.1016/j.ejmech.2011.07.001
BindingDB Entry DOI: 10.7270/Q2NG4R1D