BDBM50355599 CHEMBL1910753
SMILES: Cc1cn2c(\C=N\NC3=[NH+]CC[N-]3)c(nc2s1)-c1ccc(Cl)c(c1)[N+]([O-])=O
InChI Key: InChIKey=CGDWHNFEAAWLFW-IFRROFPPSA-O
Data: 3 IC50
Activity Spreadsheet -- Enzyme Inhibition Constant Data from BindingDB
Found 3 hits for monomerid = 50355599
Trg + Lig
Ki
nM
ΔG°
kcal/mole
IC50
nM
Kd
nM
EC50/IC50
nM
koff
s-1
kon
M-1s-1
pHTemp
°C
Serine/threonine-protein kinase Chk1
(Homo sapiens (Human))
BDBM50355599
(CHEMBL1910753)
Show SMILES Cc1cn2c(\C=N\NC3=[NH+]CC[N-]3)c(nc2s1)-c1ccc(Cl)c(c1)[N+]([O-])=O |t:8|
Show InChI InChI=1S/C16H13ClN7O2S/c1-9-8-23-13(7-20-22-15-18-4-5-19-15)14(21-16(23)27-9)10-2-3-11(17)12(6-10)24(25)26/h2-3,6-8H,4-5H2,1H3,(H-,18,19,22)/q-1/p+1/b20-7+
Reactome pathway
n/an/a>1.00E+5n/an/an/an/an/an/a
Universit£ di Bologna
Curated by ChEMBL
Assay Description
Inhibition of CHK1 assessed as inhibition of substrate phosphorylation using fluorescent peptide substrate by microplate reader assay
Eur J Med Chem 46: 4311-23 (2011)
Article DOI: 10.1016/j.ejmech.2011.07.001
BindingDB Entry DOI: 10.7270/Q2NG4R1D
Serine/threonine-protein kinase CHK2
(Homo sapiens (Human))
BDBM50355599
(CHEMBL1910753)
Show SMILES Cc1cn2c(\C=N\NC3=[NH+]CC[N-]3)c(nc2s1)-c1ccc(Cl)c(c1)[N+]([O-])=O |t:8|
Show InChI InChI=1S/C16H13ClN7O2S/c1-9-8-23-13(7-20-22-15-18-4-5-19-15)14(21-16(23)27-9)10-2-3-11(17)12(6-10)24(25)26/h2-3,6-8H,4-5H2,1H3,(H-,18,19,22)/q-1/p+1/b20-7+
n/an/a>1.00E+5n/an/an/an/an/an/a
Universit£ di Bologna
Curated by ChEMBL
Assay Description
Inhibition of CHK2 assessed as inhibition of substrate phosphorylation using fluorescent peptide substrate by microplate reader assay
Eur J Med Chem 46: 4311-23 (2011)
Article DOI: 10.1016/j.ejmech.2011.07.001
BindingDB Entry DOI: 10.7270/Q2NG4R1D
Ribosomal protein S6 kinase alpha-3
(Homo sapiens (Human))
BDBM50355599
(CHEMBL1910753)
Show SMILES Cc1cn2c(\C=N\NC3=[NH+]CC[N-]3)c(nc2s1)-c1ccc(Cl)c(c1)[N+]([O-])=O |t:8|
Show InChI InChI=1S/C16H13ClN7O2S/c1-9-8-23-13(7-20-22-15-18-4-5-19-15)14(21-16(23)27-9)10-2-3-11(17)12(6-10)24(25)26/h2-3,6-8H,4-5H2,1H3,(H-,18,19,22)/q-1/p+1/b20-7+
Reactome pathway
n/an/a 2.05E+4n/an/an/an/an/an/a
Universit£ di Bologna
Curated by ChEMBL
Assay Description
Inhibition of RSK2 assessed as inhibition of substrate phosphorylation using fluorescent peptide substrate by microplate reader assay
Eur J Med Chem 46: 4311-23 (2011)
Article DOI: 10.1016/j.ejmech.2011.07.001
BindingDB Entry DOI: 10.7270/Q2NG4R1D