BDBM50355786 CHEMBL1911625
SMILES: CN(C(=O)Cn1c2nn(-c3ccc(F)cc3)c(=O)c2c(C)c2ccccc12)c1ccc(Cl)cc1
InChI Key: InChIKey=RXPVPNNNQFZDCJ-UHFFFAOYSA-N
Data: 1 IC50
Activity Spreadsheet -- Enzyme Inhibition Constant Data from BindingDB
Found 1 hit for monomerid = 50355786
Trg + Lig
Ki
nM
ΔG°
kcal/mole
IC50
nM
Kd
nM
EC50/IC50
nM
koff
s-1
kon
M-1s-1
pHTemp
°C
Peripheral-Type Benzodiazepine Receptor
(Rattus norvegicus (rat))
BDBM50355786
(CHEMBL1911625)
Show SMILES CN(C(=O)Cn1c2nn(-c3ccc(F)cc3)c(=O)c2c(C)c2ccccc12)c1ccc(Cl)cc1
Show InChI InChI=1S/C26H20ClFN4O2/c1-16-21-5-3-4-6-22(21)31(15-23(33)30(2)19-11-7-17(27)8-12-19)25-24(16)26(34)32(29-25)20-13-9-18(28)10-14-20/h3-14H,15H2,1-2H3
n/an/a 0.280n/an/an/an/an/an/a
Universit£ degli Studi di Siena
Curated by ChEMBL
Assay Description
Displacement of [3H]PK11195 from TSPO in Sprague-Dawley rat brain homogenates after 90 mins by liquid scintillation spectrometry
J Med Chem 54: 7165-75 (2011)
Article DOI: 10.1021/jm200770f
BindingDB Entry DOI: 10.7270/Q2MG7PWM