BDBM50355807 CHEMBL1911927
SMILES: C[C@H]([C@H](F)c1ccccc1)N(C)CC#C
InChI Key: InChIKey=LUGLODFDTPSDMS-YPMHNXCESA-N
Data: 1 IC50
Activity Spreadsheet -- Enzyme Inhibition Constant Data from BindingDB
Found 1 hit for monomerid = 50355807
Trg + Lig
Ki
nM
ΔG°
kcal/mole
IC50
nM
Kd
nM
EC50/IC50
nM
koff
s-1
kon
M-1s-1
pHTemp
°C
Amine oxidase [flavin-containing] B
(Homo sapiens (Human))
BDBM50355807
(CHEMBL1911927)
Show SMILES C[C@H]([C@H](F)c1ccccc1)N(C)CC#C |r|
Show InChI InChI=1S/C13H16FN/c1-4-10-15(3)11(2)13(14)12-8-6-5-7-9-12/h1,5-9,11,13H,10H2,2-3H3/t11-,13+/m1/s1
n/an/a>2.00E+3n/an/an/an/an/an/a
Karolinska Institutet
Curated by ChEMBL
Assay Description
Inhibition of human recombinant MAO-B expressed in insect cells assessed as inhibition of kynuramine oxidation after 30 mins by fluorescence assay
J Med Chem 54: 7023-9 (2011)
Article DOI: 10.1021/jm200710b
BindingDB Entry DOI: 10.7270/Q2765FQJ