BDBM50355906 CHEMBL1910192
SMILES: Oc1ccc(cc1)-c1cncc(n1)-c1cc2cc(O)ccc2[nH]1
InChI Key: InChIKey=KBPRLLIVAKEOFQ-UHFFFAOYSA-N
Data: 3 IC50
Activity Spreadsheet -- Enzyme Inhibition Constant Data from BindingDB
Found 3 hits for monomerid = 50355906
Trg + Lig
Ki
nM
ΔG°
kcal/mole
IC50
nM
Kd
nM
EC50/IC50
nM
koff
s-1
kon
M-1s-1
pHTemp
°C
Dual-specificity tyrosine-(Y)-phosphorylation regulated kinase 1A
(RAT)
BDBM50355906
(CHEMBL1910192)
Show SMILES Oc1ccc(cc1)-c1cncc(n1)-c1cc2cc(O)ccc2[nH]1
Show InChI InChI=1S/C18H13N3O2/c22-13-3-1-11(2-4-13)17-9-19-10-18(21-17)16-8-12-7-14(23)5-6-15(12)20-16/h1-10,20,22-23H
n/an/a 340n/an/an/an/an/an/a
Universit£ d'Orl£ans
Curated by ChEMBL
Assay Description
Inhibition of rat recombinant GST-fused DYRK1A expressed in Escherichia coli using myelin protein and [33P-gamma]-ATP after 30 mins by scintillation ...
Eur J Med Chem 46: 5416-34 (2011)
Article DOI: 10.1016/j.ejmech.2011.08.048
BindingDB Entry DOI: 10.7270/Q2T1542V
Cyclin-Dependent Kinase 5 (CDK5)
(Homo sapiens (Human))
BDBM50355906
(CHEMBL1910192)
Show SMILES Oc1ccc(cc1)-c1cncc(n1)-c1cc2cc(O)ccc2[nH]1
Show InChI InChI=1S/C18H13N3O2/c22-13-3-1-11(2-4-13)17-9-19-10-18(21-17)16-8-12-7-14(23)5-6-15(12)20-16/h1-10,20,22-23H
NCI pathway
Reactome pathway
n/an/a 1.50E+3n/an/an/an/an/an/a
Universit£ d'Orl£ans
Curated by ChEMBL
Assay Description
Inhibition of human recombinant CDK5/p25 using histone H1 and [33P-gamma]-ATP after 30 mins by scintillation counting
Eur J Med Chem 46: 5416-34 (2011)
Article DOI: 10.1016/j.ejmech.2011.08.048
BindingDB Entry DOI: 10.7270/Q2T1542V
Glycogen synthase kinase-3
(Sus scrofa)
BDBM50355906
(CHEMBL1910192)
Show SMILES Oc1ccc(cc1)-c1cncc(n1)-c1cc2cc(O)ccc2[nH]1
Show InChI InChI=1S/C18H13N3O2/c22-13-3-1-11(2-4-13)17-9-19-10-18(21-17)16-8-12-7-14(23)5-6-15(12)20-16/h1-10,20,22-23H
Reactome pathway
n/an/a 4.70E+3n/an/an/an/an/an/a
Universit£ d'Orl£ans
Curated by ChEMBL
Assay Description
Inhibition of porcine brain GSK3-beta assessed as incorporation of [gamma-33P]-ATP into YRRAAVPPSPSLSRHSSPHQSpEDEEE substrate after 30 mins by scinti...
Eur J Med Chem 46: 5416-34 (2011)
Article DOI: 10.1016/j.ejmech.2011.08.048
BindingDB Entry DOI: 10.7270/Q2T1542V