BDBM50355911 CHEMBL1910197
SMILES: CS(=O)(=O)c1ccc(cc1)-c1cncc(c1)-c1cc2ccc(O)cc2[nH]1
InChI Key: InChIKey=WHNSGFXLCCFUNW-UHFFFAOYSA-N
Data: 3 IC50
Activity Spreadsheet -- Enzyme Inhibition Constant Data from BindingDB
Found 3 hits for monomerid = 50355911
Trg + Lig
Ki
nM
ΔG°
kcal/mole
IC50
nM
Kd
nM
EC50/IC50
nM
koff
s-1
kon
M-1s-1
pHTemp
°C
Dual-specificity tyrosine-(Y)-phosphorylation regulated kinase 1A
(RAT)
BDBM50355911
(CHEMBL1910197)
Show SMILES CS(=O)(=O)c1ccc(cc1)-c1cncc(c1)-c1cc2ccc(O)cc2[nH]1
Show InChI InChI=1S/C20H16N2O3S/c1-26(24,25)18-6-3-13(4-7-18)15-8-16(12-21-11-15)19-9-14-2-5-17(23)10-20(14)22-19/h2-12,22-23H,1H3
n/an/a 350n/an/an/an/an/an/a
Universit£ d'Orl£ans
Curated by ChEMBL
Assay Description
Inhibition of rat recombinant GST-fused DYRK1A expressed in Escherichia coli using myelin protein and [33P-gamma]-ATP after 30 mins by scintillation ...
Eur J Med Chem 46: 5416-34 (2011)
Article DOI: 10.1016/j.ejmech.2011.08.048
BindingDB Entry DOI: 10.7270/Q2T1542V
Cyclin-Dependent Kinase 5 (CDK5)
(Homo sapiens (Human))
BDBM50355911
(CHEMBL1910197)
Show SMILES CS(=O)(=O)c1ccc(cc1)-c1cncc(c1)-c1cc2ccc(O)cc2[nH]1
Show InChI InChI=1S/C20H16N2O3S/c1-26(24,25)18-6-3-13(4-7-18)15-8-16(12-21-11-15)19-9-14-2-5-17(23)10-20(14)22-19/h2-12,22-23H,1H3
NCI pathway
Reactome pathway
n/an/a 380n/an/an/an/an/an/a
Universit£ d'Orl£ans
Curated by ChEMBL
Assay Description
Inhibition of human recombinant CDK5/p25 using histone H1 and [33P-gamma]-ATP after 30 mins by scintillation counting
Eur J Med Chem 46: 5416-34 (2011)
Article DOI: 10.1016/j.ejmech.2011.08.048
BindingDB Entry DOI: 10.7270/Q2T1542V
Glycogen synthase kinase-3
(Sus scrofa)
BDBM50355911
(CHEMBL1910197)
Show SMILES CS(=O)(=O)c1ccc(cc1)-c1cncc(c1)-c1cc2ccc(O)cc2[nH]1
Show InChI InChI=1S/C20H16N2O3S/c1-26(24,25)18-6-3-13(4-7-18)15-8-16(12-21-11-15)19-9-14-2-5-17(23)10-20(14)22-19/h2-12,22-23H,1H3
Reactome pathway
n/an/a 1.10E+3n/an/an/an/an/an/a
Universit£ d'Orl£ans
Curated by ChEMBL
Assay Description
Inhibition of porcine brain GSK3-beta assessed as incorporation of [gamma-33P]-ATP into YRRAAVPPSPSLSRHSSPHQSpEDEEE substrate after 30 mins by scinti...
Eur J Med Chem 46: 5416-34 (2011)
Article DOI: 10.1016/j.ejmech.2011.08.048
BindingDB Entry DOI: 10.7270/Q2T1542V