BDBM50355920 CHEMBL1910390
SMILES: CCN1CCC2(CCCN(C2)C2CCN(CC2)C(=O)c2c3ccccc3cc3ccccc23)C1=O
InChI Key: InChIKey=OCMDYJWGAQELTA-UHFFFAOYSA-N
Data: 2 IC50
Activity Spreadsheet -- Enzyme Inhibition Constant Data from BindingDB
Found 2 hits for monomerid = 50355920
Trg + Lig
Ki
nM
ΔG°
kcal/mole
IC50
nM
Kd
nM
EC50/IC50
nM
koff
s-1
kon
M-1s-1
pHTemp
°C
Acetyl-CoA carboxylase 2 (ACC2)
(Homo sapiens (Human))
BDBM50355920
(CHEMBL1910390)
Show SMILES CCN1CCC2(CCCN(C2)C2CCN(CC2)C(=O)c2c3ccccc3cc3ccccc23)C1=O
Show InChI InChI=1S/C30H35N3O2/c1-2-31-19-15-30(29(31)35)14-7-16-33(21-30)24-12-17-32(18-13-24)28(34)27-25-10-5-3-8-22(25)20-23-9-4-6-11-26(23)27/h3-6,8-11,20,24H,2,7,12-19,21H2,1H3
Reactome pathway
n/an/a 140n/an/an/an/an/an/a
Takeda Pharmaceutical Company, Ltd
Curated by ChEMBL
Assay Description
Inhibition of human ACC2
Bioorg Med Chem Lett 21: 6314-8 (2011)
Article DOI: 10.1016/j.bmcl.2011.08.117
BindingDB Entry DOI: 10.7270/Q2P84C9P
Acetyl-CoA carboxylase 1 (ACC1)
(Homo sapiens (Human))
BDBM50355920
(CHEMBL1910390)
Show SMILES CCN1CCC2(CCCN(C2)C2CCN(CC2)C(=O)c2c3ccccc3cc3ccccc23)C1=O
Show InChI InChI=1S/C30H35N3O2/c1-2-31-19-15-30(29(31)35)14-7-16-33(21-30)24-12-17-32(18-13-24)28(34)27-25-10-5-3-8-22(25)20-23-9-4-6-11-26(23)27/h3-6,8-11,20,24H,2,7,12-19,21H2,1H3
n/an/a 1.90E+3n/an/an/an/an/an/a
Takeda Pharmaceutical Company, Ltd
Curated by ChEMBL
Assay Description
Inhibition of human ACC1
Bioorg Med Chem Lett 21: 6314-8 (2011)
Article DOI: 10.1016/j.bmcl.2011.08.117
BindingDB Entry DOI: 10.7270/Q2P84C9P