BDBM50355930 CHEMBL1910400
SMILES: CCNC(=O)Nc1sc2ccccc2c1C(=O)N1CCC(CC1)N1CCCC2(CC(C)(C)OC2=O)C1
InChI Key: InChIKey=DSUNZEZCXUMUEH-UHFFFAOYSA-N
Data: 2 IC50
PDB links: 1 PDB ID matches this monomer.
Activity Spreadsheet -- Enzyme Inhibition Constant Data from BindingDB
Found 2 hits for monomerid = 50355930
Trg + Lig
Ki
nM
ΔG°
kcal/mole
IC50
nM
Kd
nM
EC50/IC50
nM
koff
s-1
kon
M-1s-1
pHTemp
°C
Acetyl-CoA carboxylase 2 (ACC2)
(Homo sapiens (Human))
BDBM50355930
(CHEMBL1910400)
Show SMILES CCNC(=O)Nc1sc2ccccc2c1C(=O)N1CCC(CC1)N1CCCC2(CC(C)(C)OC2=O)C1
Show InChI InChI=1S/C27H36N4O4S/c1-4-28-25(34)29-22-21(19-8-5-6-9-20(19)36-22)23(32)30-14-10-18(11-15-30)31-13-7-12-27(17-31)16-26(2,3)35-24(27)33/h5-6,8-9,18H,4,7,10-17H2,1-3H3,(H2,28,29,34)
Reactome pathway
n/an/a 13n/an/an/an/an/an/a
Takeda Pharmaceutical Company, Ltd
Curated by ChEMBL
Assay Description
Inhibition of human ACC2
Bioorg Med Chem Lett 21: 6314-8 (2011)
Article DOI: 10.1016/j.bmcl.2011.08.117
BindingDB Entry DOI: 10.7270/Q2P84C9P
3D
3D Structure (crystal)
Acetyl-CoA carboxylase 1 (ACC1)
(Homo sapiens (Human))
BDBM50355930
(CHEMBL1910400)
Show SMILES CCNC(=O)Nc1sc2ccccc2c1C(=O)N1CCC(CC1)N1CCCC2(CC(C)(C)OC2=O)C1
Show InChI InChI=1S/C27H36N4O4S/c1-4-28-25(34)29-22-21(19-8-5-6-9-20(19)36-22)23(32)30-14-10-18(11-15-30)31-13-7-12-27(17-31)16-26(2,3)35-24(27)33/h5-6,8-9,18H,4,7,10-17H2,1-3H3,(H2,28,29,34)
n/an/a 63n/an/an/an/an/an/a
Takeda Pharmaceutical Company, Ltd
Curated by ChEMBL
Assay Description
Inhibition of human ACC1
Bioorg Med Chem Lett 21: 6314-8 (2011)
Article DOI: 10.1016/j.bmcl.2011.08.117
BindingDB Entry DOI: 10.7270/Q2P84C9P