null
SMILES: CC(C)(CO)[C@H]1Nc2ccc(cc2[C@H]2NCC[C@@H]12)[N+]([O-])=O
InChI Key: InChIKey=ZXCBUKTZCUHDAO-SWHYSGLUSA-N
Activity Spreadsheet -- Enzyme Inhibition Constant Data from BindingDB
Found 1 hit for monomerid = 50355939
Trg + Lig
Ki
nM
ΔG°
kcal/mole
IC50
nM
Kd
nM
EC50/IC50
nM
koff
s-1
kon
M-1s-1
pHTemp
°C
Androgen receptor
(Rattus norvegicus (Rat))
BDBM50355939
(CHEMBL1910407)
Show SMILES CC(C)(CO)[C@H]1Nc2ccc(cc2[C@H]2NCC[C@@H]12)[N+]([O-])=O |r|
Show InChI InChI=1S/C15H21N3O3/c1-15(2,8-19)14-10-5-6-16-13(10)11-7-9(18(20)21)3-4-12(11)17-14/h3-4,7,10,13-14,16-17,19H,5-6,8H2,1-2H3/t10-,13+,14+/m1/s1
Reactome pathway
n/an/a>1.00E+3n/an/an/an/an/an/a
Kaken Pharmaceutical Co., Ltd
Curated by ChEMBL
Assay Description
Competitive binding affinity to rat androgen receptor
Bioorg Med Chem Lett 21: 6310-3 (2011)
Checked by Author
Article DOI: 10.1016/j.bmcl.2011.08.118
BindingDB Entry DOI: 10.7270/Q2JH3MKZ