BDBM50355946 CHEMBL1910415
SMILES: CC(C)NC(=O)N[C@H]1C[C@H](Nc2ccc(cc12)[N+]([O-])=O)C(C)(C)CO
InChI Key: InChIKey=YWOPUJOSRGQHHG-GJZGRUSLSA-N
Data: 1 IC50
Activity Spreadsheet -- Enzyme Inhibition Constant Data from BindingDB
Found 1 hit for monomerid = 50355946
Trg + Lig
Ki
nM
ΔG°
kcal/mole
IC50
nM
Kd
nM
EC50/IC50
nM
koff
s-1
kon
M-1s-1
pHTemp
°C
Androgen receptor
(Rattus norvegicus (Rat))
BDBM50355946
(CHEMBL1910415)
Show SMILES CC(C)NC(=O)N[C@H]1C[C@H](Nc2ccc(cc12)[N+]([O-])=O)C(C)(C)CO |r|
Show InChI InChI=1S/C17H26N4O4/c1-10(2)18-16(23)20-14-8-15(17(3,4)9-22)19-13-6-5-11(21(24)25)7-12(13)14/h5-7,10,14-15,19,22H,8-9H2,1-4H3,(H2,18,20,23)/t14-,15-/m0/s1
Reactome pathway
n/an/a>1.00E+3n/an/an/an/an/an/a
Kaken Pharmaceutical Co., Ltd
Curated by ChEMBL
Assay Description
Competitive binding affinity to rat androgen receptor
Bioorg Med Chem Lett 21: 6310-3 (2011)
Checked by Author
Article DOI: 10.1016/j.bmcl.2011.08.118
BindingDB Entry DOI: 10.7270/Q2JH3MKZ