BDBM50355947 CHEMBL1910416
SMILES: CC(C)N\C([S-])=[NH+]/C1CC(Nc2ccc(cc12)[N+]([O-])=O)C(C)(C)CO
InChI Key: InChIKey=WQCYUBYHVJUJKZ-UHFFFAOYSA-N
Data: 1 IC50
Activity Spreadsheet -- Enzyme Inhibition Constant Data from BindingDB
Found 1 hit for monomerid = 50355947
Trg + Lig
Ki
nM
ΔG°
kcal/mole
IC50
nM
Kd
nM
EC50/IC50
nM
koff
s-1
kon
M-1s-1
pHTemp
°C
Androgen receptor
(Rattus norvegicus (Rat))
BDBM50355947
(CHEMBL1910416)
Show SMILES CC(C)N\C([S-])=[NH+]/C1CC(Nc2ccc(cc12)[N+]([O-])=O)C(C)(C)CO
Show InChI InChI=1S/C17H26N4O3S/c1-10(2)18-16(25)20-14-8-15(17(3,4)9-22)19-13-6-5-11(21(23)24)7-12(13)14/h5-7,10,14-15,19,22H,8-9H2,1-4H3,(H2,18,20,25)
Reactome pathway
n/an/a>1.00E+3n/an/an/an/an/an/a
Kaken Pharmaceutical Co., Ltd
Curated by ChEMBL
Assay Description
Competitive binding affinity to rat androgen receptor
Bioorg Med Chem Lett 21: 6310-3 (2011)
Checked by Author
Article DOI: 10.1016/j.bmcl.2011.08.118
BindingDB Entry DOI: 10.7270/Q2JH3MKZ