BDBM50355951 CHEMBL1910420
SMILES: CCS(=O)(=O)[C@H]1C[C@H](Nc2ccc(cc12)[N+]([O-])=O)C(C)(C)CO
InChI Key: InChIKey=BUPDLZIYZYSTEG-KBPBESRZSA-N
Data: 1 IC50
Activity Spreadsheet -- Enzyme Inhibition Constant Data from BindingDB
Found 1 hit for monomerid = 50355951
Trg + Lig
Ki
nM
ΔG°
kcal/mole
IC50
nM
Kd
nM
EC50/IC50
nM
koff
s-1
kon
M-1s-1
pHTemp
°C
Androgen receptor
(Rattus norvegicus (Rat))
BDBM50355951
(CHEMBL1910420)
Show SMILES CCS(=O)(=O)[C@H]1C[C@H](Nc2ccc(cc12)[N+]([O-])=O)C(C)(C)CO |r|
Show InChI InChI=1S/C15H22N2O5S/c1-4-23(21,22)13-8-14(15(2,3)9-18)16-12-6-5-10(17(19)20)7-11(12)13/h5-7,13-14,16,18H,4,8-9H2,1-3H3/t13-,14-/m0/s1
Reactome pathway
n/an/a>1.00E+3n/an/an/an/an/an/a
Kaken Pharmaceutical Co., Ltd
Curated by ChEMBL
Assay Description
Competitive binding affinity to rat androgen receptor
Bioorg Med Chem Lett 21: 6310-3 (2011)
Checked by Author
Article DOI: 10.1016/j.bmcl.2011.08.118
BindingDB Entry DOI: 10.7270/Q2JH3MKZ