BDBM50355960 CHEMBL1910642
SMILES: NCCCC[C@H](NC(=O)c1ccc(OCc2ccncc2)c(NC(=O)CCc2cn(Cc3ccc(F)cc3)c3ccccc23)c1)C#N
InChI Key: InChIKey=QKEXCTCUWLBMGS-HKBQPEDESA-N
Data: 1 IC50
Activity Spreadsheet -- Enzyme Inhibition Constant Data from BindingDB
Found 1 hit for monomerid = 50355960
Trg + Lig
Ki
nM
ΔG°
kcal/mole
IC50
nM
Kd
nM
EC50/IC50
nM
koff
s-1
kon
M-1s-1
pHTemp
°C
Plasminogen
(Homo sapiens (Human))
BDBM50355960
(CHEMBL1910642)
Show SMILES NCCCC[C@H](NC(=O)c1ccc(OCc2ccncc2)c(NC(=O)CCc2cn(Cc3ccc(F)cc3)c3ccccc23)c1)C#N |r|
Show InChI InChI=1S/C37H37FN6O3/c38-30-12-8-26(9-13-30)23-44-24-29(32-6-1-2-7-34(32)44)11-15-36(45)43-33-21-28(37(46)42-31(22-40)5-3-4-18-39)10-14-35(33)47-25-27-16-19-41-20-17-27/h1-2,6-10,12-14,16-17,19-21,24,31H,3-5,11,15,18,23,25,39H2,(H,42,46)(H,43,45)/t31-/m0/s1
NCI pathway
Reactome pathway
n/an/a 1.40E+5n/an/an/an/an/an/a
Hiroshima International University
Curated by ChEMBL
Assay Description
Inhibition of plasmin
Bioorg Med Chem Lett 21: 6305-9 (2011)
Article DOI: 10.1016/j.bmcl.2011.08.121
BindingDB Entry DOI: 10.7270/Q2DR2VX4