BDBM50356079 CHEMBL1911814
SMILES: CN1CCN(CC1)C(=O)[C@@H](COCc1ccccc1)NC(=O)c1cc(F)cnc1Oc1ccc(Cl)cc1Cl
InChI Key: InChIKey=YYFYVPVJVJMRQP-HSZRJFAPSA-N
Data: 1 IC50
Activity Spreadsheet -- Enzyme Inhibition Constant Data from BindingDB
Found 1 hit for monomerid = 50356079
Trg + Lig
Ki
nM
ΔG°
kcal/mole
IC50
nM
Kd
nM
EC50/IC50
nM
koff
s-1
kon
M-1s-1
pHTemp
°C
Ceramide glucosyltransferase
(Homo sapiens (Human))
BDBM50356079
(CHEMBL1911814)
Show SMILES CN1CCN(CC1)C(=O)[C@@H](COCc1ccccc1)NC(=O)c1cc(F)cnc1Oc1ccc(Cl)cc1Cl |r|
Show InChI InChI=1S/C27H27Cl2FN4O4/c1-33-9-11-34(12-10-33)27(36)23(17-37-16-18-5-3-2-4-6-18)32-25(35)21-14-20(30)15-31-26(21)38-24-8-7-19(28)13-22(24)29/h2-8,13-15,23H,9-12,16-17H2,1H3,(H,32,35)/t23-/m1/s1
NCI pathway
Reactome pathway
n/an/a 3n/an/an/an/an/an/a
Exelixis
Curated by ChEMBL
Assay Description
Inhibition of GCS assessed as amount of UDP-glucose consumed during enzyme-catalyzed reaction
Bioorg Med Chem Lett 21: 6773-7 (2011)
Article DOI: 10.1016/j.bmcl.2011.09.037
BindingDB Entry DOI: 10.7270/Q2833SG2