BDBM50356207 CHEMBL1910460
SMILES: CC(C)[C@@H](NS(=O)(=O)c1ccc(cc1)-c1ccc(OCc2ccnc3ccccc23)cc1)C(O)=O
InChI Key: InChIKey=SRNVCZIFDUXAJE-AREMUKBSSA-N
Data: 2 IC50
Activity Spreadsheet -- Enzyme Inhibition Constant Data from BindingDB
Found 2 hits for monomerid = 50356207
Trg + Lig
Ki
nM
ΔG°
kcal/mole
IC50
nM
Kd
nM
EC50/IC50
nM
koff
s-1
kon
M-1s-1
pHTemp
°C
Collagenase 3
(Homo sapiens (Human))
BDBM50356207
(CHEMBL1910460)
Show SMILES CC(C)[C@@H](NS(=O)(=O)c1ccc(cc1)-c1ccc(OCc2ccnc3ccccc23)cc1)C(O)=O |r|
Show InChI InChI=1S/C27H26N2O5S/c1-18(2)26(27(30)31)29-35(32,33)23-13-9-20(10-14-23)19-7-11-22(12-8-19)34-17-21-15-16-28-25-6-4-3-5-24(21)25/h3-16,18,26,29H,17H2,1-2H3,(H,30,31)/t26-/m1/s1
NCI pathway
Reactome pathway
n/an/a 5.20n/an/an/an/an/an/a
Pfizer Inc.
Curated by ChEMBL
Assay Description
Inhibition of MMP13
Bioorg Med Chem Lett 21: 6800-3 (2011)
Article DOI: 10.1016/j.bmcl.2011.09.036
BindingDB Entry DOI: 10.7270/Q2BV7H23
A disintegrin and metalloproteinase with thrombospondin motifs 4 (ADAMTS-4)
(Homo sapiens (Human))
BDBM50356207
(CHEMBL1910460)
Show SMILES CC(C)[C@@H](NS(=O)(=O)c1ccc(cc1)-c1ccc(OCc2ccnc3ccccc23)cc1)C(O)=O |r|
Show InChI InChI=1S/C27H26N2O5S/c1-18(2)26(27(30)31)29-35(32,33)23-13-9-20(10-14-23)19-7-11-22(12-8-19)34-17-21-15-16-28-25-6-4-3-5-24(21)25/h3-16,18,26,29H,17H2,1-2H3,(H,30,31)/t26-/m1/s1
Reactome pathway
n/an/a 1.00E+3n/an/an/an/an/an/a
Pfizer Inc.
Curated by ChEMBL
Assay Description
Inhibition of aggrecanase-1
Bioorg Med Chem Lett 21: 6800-3 (2011)
Article DOI: 10.1016/j.bmcl.2011.09.036
BindingDB Entry DOI: 10.7270/Q2BV7H23