BDBM50356332 CHEMBL1911252::CHEMBL554140
SMILES: [#6]-[#8]-[#6](=O)-c1ccc(-[#8]-[#6](=O)-c2ccc(cc2)\[#7]=[#6](\[#7])-[#7])cc1
InChI Key: InChIKey=NIBWPUGZCXNNPC-UHFFFAOYSA-N
Data: 3 IC50
Activity Spreadsheet -- Enzyme Inhibition Constant Data from BindingDB
Found 3 hits for monomerid = 50356332
Trg + Lig
Ki
nM
ΔG°
kcal/mole
IC50
nM
Kd
nM
EC50/IC50
nM
koff
s-1
kon
M-1s-1
pHTemp
°C
Acrosin
(Homo sapiens (Human))
BDBM50356332
(CHEMBL1911252 | CHEMBL554140)
Show SMILES [#6]-[#8]-[#6](=O)-c1ccc(-[#8]-[#6](=O)-c2ccc(cc2)\[#7]=[#6](\[#7])-[#7])cc1
Show InChI InChI=1S/C16H15N3O4/c1-22-14(20)10-4-8-13(9-5-10)23-15(21)11-2-6-12(7-3-11)19-16(17)18/h2-9H,1H3,(H4,17,18,19)
Reactome pathway
n/an/a 2.70E+4n/an/an/an/an/an/a
Second Military Medical University
Curated by ChEMBL
Assay Description
Inhibition of acrosin activity in human spermatozoa using N-alpha-benzoyl-DL-arginine para-nitroanilide-HCI as a substrate after 3 hrs by spectrophot...
Bioorg Med Chem Lett 21: 6674-7 (2011)
Article DOI: 10.1016/j.bmcl.2011.09.060
BindingDB Entry DOI: 10.7270/Q2TT4RBF
Acrosin
(Homo sapiens (Human))
BDBM50356332
(CHEMBL1911252 | CHEMBL554140)
Show SMILES [#6]-[#8]-[#6](=O)-c1ccc(-[#8]-[#6](=O)-c2ccc(cc2)\[#7]=[#6](\[#7])-[#7])cc1
Show InChI InChI=1S/C16H15N3O4/c1-22-14(20)10-4-8-13(9-5-10)23-15(21)11-2-6-12(7-3-11)19-16(17)18/h2-9H,1H3,(H4,17,18,19)
Reactome pathway
n/an/a 0.670n/an/an/an/an/an/a
TBA
Curated by ChEMBL
Assay Description
Inhibition of human acrosin and control activity being 11.3 umol/min/mg
J Med Chem 29: 514-9 (1986)
BindingDB Entry DOI: 10.7270/Q20C4WZ7
Trypsin-1
(Homo sapiens (Human))
BDBM50356332
(CHEMBL1911252 | CHEMBL554140)
Show SMILES [#6]-[#8]-[#6](=O)-c1ccc(-[#8]-[#6](=O)-c2ccc(cc2)\[#7]=[#6](\[#7])-[#7])cc1
Show InChI InChI=1S/C16H15N3O4/c1-22-14(20)10-4-8-13(9-5-10)23-15(21)11-2-6-12(7-3-11)19-16(17)18/h2-9H,1H3,(H4,17,18,19)
Reactome pathway
n/an/a 1.5n/an/an/an/an/an/a
TBA
Curated by ChEMBL
Assay Description
Inhibition of human trypsin and the control activity being 7.3 umol/min/mg
J Med Chem 29: 514-9 (1986)
BindingDB Entry DOI: 10.7270/Q20C4WZ7