BDBM50356478 CHEMBL1911986
SMILES: Cc1cc(nc(n1)-n1ccnc1)C1CCCN1C(=O)NCCc1ccc2OCOc2c1
InChI Key: InChIKey=ZQGNSPWUEMSBGT-UHFFFAOYSA-N
Data: 3 EC50
Activity Spreadsheet -- Enzyme Inhibition Constant Data from BindingDB
Found 3 hits for monomerid = 50356478
Trg + Lig
Ki
nM
ΔG°
kcal/mole
IC50
nM
Kd
nM
EC50/IC50
nM
koff
s-1
kon
M-1s-1
pHTemp
°C
Nitric oxide synthase, inducible
(Homo sapiens (Human))
BDBM50356478
(CHEMBL1911986)
Show SMILES Cc1cc(nc(n1)-n1ccnc1)C1CCCN1C(=O)NCCc1ccc2OCOc2c1
Show InChI InChI=1S/C22H24N6O3/c1-15-11-17(26-21(25-15)27-10-8-23-13-27)18-3-2-9-28(18)22(29)24-7-6-16-4-5-19-20(12-16)31-14-30-19/h4-5,8,10-13,18H,2-3,6-7,9,14H2,1H3,(H,24,29)
NCI pathway
Reactome pathway
n/an/an/an/a 9n/an/an/an/a
Kalypsys Inc.
Curated by ChEMBL
Assay Description
Inhibition of human iNOS expressed in human HEK293 cells assessed as nitrite accumulation after 18 hrs by 2,3-diaminonapthalene assay
Bioorg Med Chem Lett 21: 6888-94 (2011)
Article DOI: 10.1016/j.bmcl.2011.08.112
BindingDB Entry DOI: 10.7270/Q2XK8FXC
Nitric oxide synthase, endothelial
(Homo sapiens (Human))
BDBM50356478
(CHEMBL1911986)
Show SMILES Cc1cc(nc(n1)-n1ccnc1)C1CCCN1C(=O)NCCc1ccc2OCOc2c1
Show InChI InChI=1S/C22H24N6O3/c1-15-11-17(26-21(25-15)27-10-8-23-13-27)18-3-2-9-28(18)22(29)24-7-6-16-4-5-19-20(12-16)31-14-30-19/h4-5,8,10-13,18H,2-3,6-7,9,14H2,1H3,(H,24,29)
n/an/an/an/a>1.00E+5n/an/an/an/a
Kalypsys Inc.
Curated by ChEMBL
Assay Description
Inhibition of human eNOS expressed in HEK293 cells assessed as inhibition A23187-induced nitric oxide production incubated for 24 hrs measured after ...
Bioorg Med Chem Lett 21: 6888-94 (2011)
Article DOI: 10.1016/j.bmcl.2011.08.112
BindingDB Entry DOI: 10.7270/Q2XK8FXC
Nitric oxide synthase, brain
(Homo sapiens (Human))
BDBM50356478
(CHEMBL1911986)
Show SMILES Cc1cc(nc(n1)-n1ccnc1)C1CCCN1C(=O)NCCc1ccc2OCOc2c1
Show InChI InChI=1S/C22H24N6O3/c1-15-11-17(26-21(25-15)27-10-8-23-13-27)18-3-2-9-28(18)22(29)24-7-6-16-4-5-19-20(12-16)31-14-30-19/h4-5,8,10-13,18H,2-3,6-7,9,14H2,1H3,(H,24,29)
Reactome pathway
n/an/an/an/a 2.70E+3n/an/an/an/a
Kalypsys Inc.
Curated by ChEMBL
Assay Description
Inhibition of human nNOS expressed in HEK293 cells assessed as inhibition ionomycin-induced nitric oxide production incubated for 24 hrs measured aft...
Bioorg Med Chem Lett 21: 6888-94 (2011)
Article DOI: 10.1016/j.bmcl.2011.08.112
BindingDB Entry DOI: 10.7270/Q2XK8FXC