BDBM50356491 CHEMBL1911994
SMILES: CNC(=O)CN(CCCNCc1ccc2OCOc2c1)c1nc(ns1)-n1ccnc1
InChI Key: InChIKey=WZXNYNMOMFZZHT-UHFFFAOYSA-N
Data: 3 EC50
Activity Spreadsheet -- Enzyme Inhibition Constant Data from BindingDB
Found 3 hits for monomerid = 50356491
Trg + Lig
Ki
nM
ΔG°
kcal/mole
IC50
nM
Kd
nM
EC50/IC50
nM
koff
s-1
kon
M-1s-1
pHTemp
°C
Nitric oxide synthase, inducible
(Homo sapiens (Human))
BDBM50356491
(CHEMBL1911994)
Show SMILES CNC(=O)CN(CCCNCc1ccc2OCOc2c1)c1nc(ns1)-n1ccnc1
Show InChI InChI=1S/C19H23N7O3S/c1-20-17(27)11-25(19-23-18(24-30-19)26-8-6-22-12-26)7-2-5-21-10-14-3-4-15-16(9-14)29-13-28-15/h3-4,6,8-9,12,21H,2,5,7,10-11,13H2,1H3,(H,20,27)
NCI pathway
Reactome pathway
n/an/an/an/a 59n/an/an/an/a
Kalypsys Inc.
Curated by ChEMBL
Assay Description
Inhibition of human iNOS expressed in human HEK293 cells assessed as nitrite accumulation after 18 hrs by 2,3-diaminonapthalene assay
Bioorg Med Chem Lett 21: 6888-94 (2011)
Article DOI: 10.1016/j.bmcl.2011.08.112
BindingDB Entry DOI: 10.7270/Q2XK8FXC
Nitric oxide synthase, endothelial
(Homo sapiens (Human))
BDBM50356491
(CHEMBL1911994)
Show SMILES CNC(=O)CN(CCCNCc1ccc2OCOc2c1)c1nc(ns1)-n1ccnc1
Show InChI InChI=1S/C19H23N7O3S/c1-20-17(27)11-25(19-23-18(24-30-19)26-8-6-22-12-26)7-2-5-21-10-14-3-4-15-16(9-14)29-13-28-15/h3-4,6,8-9,12,21H,2,5,7,10-11,13H2,1H3,(H,20,27)
n/an/an/an/a>1.00E+5n/an/an/an/a
Kalypsys Inc.
Curated by ChEMBL
Assay Description
Inhibition of human eNOS expressed in HEK293 cells assessed as inhibition A23187-induced nitric oxide production incubated for 24 hrs measured after ...
Bioorg Med Chem Lett 21: 6888-94 (2011)
Article DOI: 10.1016/j.bmcl.2011.08.112
BindingDB Entry DOI: 10.7270/Q2XK8FXC
Nitric oxide synthase, brain
(Homo sapiens (Human))
BDBM50356491
(CHEMBL1911994)
Show SMILES CNC(=O)CN(CCCNCc1ccc2OCOc2c1)c1nc(ns1)-n1ccnc1
Show InChI InChI=1S/C19H23N7O3S/c1-20-17(27)11-25(19-23-18(24-30-19)26-8-6-22-12-26)7-2-5-21-10-14-3-4-15-16(9-14)29-13-28-15/h3-4,6,8-9,12,21H,2,5,7,10-11,13H2,1H3,(H,20,27)
Reactome pathway
n/an/an/an/a 7.20E+3n/an/an/an/a
Kalypsys Inc.
Curated by ChEMBL
Assay Description
Inhibition of human nNOS expressed in HEK293 cells assessed as inhibition ionomycin-induced nitric oxide production incubated for 24 hrs measured aft...
Bioorg Med Chem Lett 21: 6888-94 (2011)
Article DOI: 10.1016/j.bmcl.2011.08.112
BindingDB Entry DOI: 10.7270/Q2XK8FXC