BDBM50356494 CHEMBL1911992
SMILES: NC(=O)CN(CCCNCc1ccc2OCOc2c1)c1nc(ns1)-n1ccnc1
InChI Key: InChIKey=SLYPMORLYIBWOV-UHFFFAOYSA-N
Data: 3 EC50
Activity Spreadsheet -- Enzyme Inhibition Constant Data from BindingDB
Found 3 hits for monomerid = 50356494
Trg + Lig
Ki
nM
ΔG°
kcal/mole
IC50
nM
Kd
nM
EC50/IC50
nM
koff
s-1
kon
M-1s-1
pHTemp
°C
Nitric oxide synthase, inducible
(Homo sapiens (Human))
BDBM50356494
(CHEMBL1911992)
Show SMILES NC(=O)CN(CCCNCc1ccc2OCOc2c1)c1nc(ns1)-n1ccnc1
Show InChI InChI=1S/C18H21N7O3S/c19-16(26)10-24(18-22-17(23-29-18)25-7-5-21-11-25)6-1-4-20-9-13-2-3-14-15(8-13)28-12-27-14/h2-3,5,7-8,11,20H,1,4,6,9-10,12H2,(H2,19,26)
NCI pathway
Reactome pathway
n/an/an/an/a 81n/an/an/an/a
Kalypsys Inc.
Curated by ChEMBL
Assay Description
Inhibition of human iNOS expressed in human HEK293 cells assessed as nitrite accumulation after 18 hrs by 2,3-diaminonapthalene assay
Bioorg Med Chem Lett 21: 6888-94 (2011)
Article DOI: 10.1016/j.bmcl.2011.08.112
BindingDB Entry DOI: 10.7270/Q2XK8FXC
Nitric oxide synthase, endothelial
(Homo sapiens (Human))
BDBM50356494
(CHEMBL1911992)
Show SMILES NC(=O)CN(CCCNCc1ccc2OCOc2c1)c1nc(ns1)-n1ccnc1
Show InChI InChI=1S/C18H21N7O3S/c19-16(26)10-24(18-22-17(23-29-18)25-7-5-21-11-25)6-1-4-20-9-13-2-3-14-15(8-13)28-12-27-14/h2-3,5,7-8,11,20H,1,4,6,9-10,12H2,(H2,19,26)
n/an/an/an/a>1.00E+5n/an/an/an/a
Kalypsys Inc.
Curated by ChEMBL
Assay Description
Inhibition of human eNOS expressed in HEK293 cells assessed as inhibition A23187-induced nitric oxide production incubated for 24 hrs measured after ...
Bioorg Med Chem Lett 21: 6888-94 (2011)
Article DOI: 10.1016/j.bmcl.2011.08.112
BindingDB Entry DOI: 10.7270/Q2XK8FXC
Nitric oxide synthase, brain
(Homo sapiens (Human))
BDBM50356494
(CHEMBL1911992)
Show SMILES NC(=O)CN(CCCNCc1ccc2OCOc2c1)c1nc(ns1)-n1ccnc1
Show InChI InChI=1S/C18H21N7O3S/c19-16(26)10-24(18-22-17(23-29-18)25-7-5-21-11-25)6-1-4-20-9-13-2-3-14-15(8-13)28-12-27-14/h2-3,5,7-8,11,20H,1,4,6,9-10,12H2,(H2,19,26)
Reactome pathway
n/an/an/an/a 1.10E+4n/an/an/an/a
Kalypsys Inc.
Curated by ChEMBL
Assay Description
Inhibition of human nNOS expressed in HEK293 cells assessed as inhibition ionomycin-induced nitric oxide production incubated for 24 hrs measured aft...
Bioorg Med Chem Lett 21: 6888-94 (2011)
Article DOI: 10.1016/j.bmcl.2011.08.112
BindingDB Entry DOI: 10.7270/Q2XK8FXC