BDBM50356519 CHEMBL1909699
SMILES: OC(CN(CCc1ccccc1)C(=O)c1ccccc1)Cn1c2ccccc2c2ccccc12
InChI Key: InChIKey=SAVNFICIQAMBBZ-UHFFFAOYSA-N
Data: 1 IC50
Activity Spreadsheet -- Enzyme Inhibition Constant Data from BindingDB
Found 1 hit for monomerid = 50356519
Trg + Lig
Ki
nM
ΔG°
kcal/mole
IC50
nM
Kd
nM
EC50/IC50
nM
koff
s-1
kon
M-1s-1
pHTemp
°C
Beta-secretase 1
(Homo sapiens (Human))
BDBM50356519
(CHEMBL1909699)
Show SMILES OC(CN(CCc1ccccc1)C(=O)c1ccccc1)Cn1c2ccccc2c2ccccc12
Show InChI InChI=1S/C30H28N2O2/c33-25(22-32-28-17-9-7-15-26(28)27-16-8-10-18-29(27)32)21-31(20-19-23-11-3-1-4-12-23)30(34)24-13-5-2-6-14-24/h1-18,25,33H,19-22H2
n/an/a 4.80E+3n/an/an/an/an/an/a
Universit£ di Pisa
Curated by ChEMBL
Assay Description
Inhibition of BACE1 by fluorescence-based assay
Bioorg Med Chem Lett 21: 6657-61 (2011)
Article DOI: 10.1016/j.bmcl.2011.09.064
BindingDB Entry DOI: 10.7270/Q2ST7Q7H