BDBM50356667 CHEMBL1917582
SMILES: CC(C)c1ccc(cc1C#Cc1cc(Cl)ccc1OCC(O)=O)S(C)(=O)=O
InChI Key: InChIKey=JYAOXMZQLSENSK-UHFFFAOYSA-N
Data: 1 KI  1 IC50
Activity Spreadsheet -- Enzyme Inhibition Constant Data from BindingDB
Found 2 hits for monomerid = 50356667
Trg + Lig
Ki
nM
ΔG°
kcal/mole
IC50
nM
Kd
nM
EC50/IC50
nM
koff
s-1
kon
M-1s-1
pHTemp
°C
G protein-coupled receptor 44
(Homo sapiens (Human))
BDBM50356667
(CHEMBL1917582)
Show SMILES CC(C)c1ccc(cc1C#Cc1cc(Cl)ccc1OCC(O)=O)S(C)(=O)=O
Show InChI InChI=1S/C20H19ClO5S/c1-13(2)18-8-7-17(27(3,24)25)11-14(18)4-5-15-10-16(21)6-9-19(15)26-12-20(22)23/h6-11,13H,12H2,1-3H3,(H,22,23)
Reactome pathway
4.60n/an/an/an/an/an/an/an/a
Merck Serono S.A.
Curated by ChEMBL
Assay Description
Displacement of [3H]PGD2 from human CRTH2 expressed in chinese hamster CHO cells by liquid scintillation counting
J Med Chem 54: 7299-317 (2011)
Article DOI: 10.1021/jm200866y
BindingDB Entry DOI: 10.7270/Q2N58MS1
G protein-coupled receptor 44
(Homo sapiens (Human))
BDBM50356667
(CHEMBL1917582)
Show SMILES CC(C)c1ccc(cc1C#Cc1cc(Cl)ccc1OCC(O)=O)S(C)(=O)=O
Show InChI InChI=1S/C20H19ClO5S/c1-13(2)18-8-7-17(27(3,24)25)11-14(18)4-5-15-10-16(21)6-9-19(15)26-12-20(22)23/h6-11,13H,12H2,1-3H3,(H,22,23)
Reactome pathway
n/an/a 360n/an/an/an/an/an/a
Merck Serono S.A.
Curated by ChEMBL
Assay Description
Antagonist activity at CRTH2 in human blood cells assessed as inhibition of PGD2-induced eosinophil cell shape change after 10 mins by flow cytometry
J Med Chem 54: 7299-317 (2011)
Article DOI: 10.1021/jm200866y
BindingDB Entry DOI: 10.7270/Q2N58MS1