BDBM50356694 CHEMBL1917609
SMILES: COCCN(C)S(=O)(=O)c1ccc(C)c(c1)C#Cc1cc(Cl)ccc1OCC(O)=O
InChI Key: InChIKey=XTDSCYOOKNWQST-UHFFFAOYSA-N
Data: 1 KI  1 IC50
Activity Spreadsheet -- Enzyme Inhibition Constant Data from BindingDB
Found 2 hits for monomerid = 50356694
Trg + Lig
Ki
nM
ΔG°
kcal/mole
IC50
nM
Kd
nM
EC50/IC50
nM
koff
s-1
kon
M-1s-1
pHTemp
°C
G protein-coupled receptor 44
(Homo sapiens (Human))
BDBM50356694
(CHEMBL1917609)
Show SMILES COCCN(C)S(=O)(=O)c1ccc(C)c(c1)C#Cc1cc(Cl)ccc1OCC(O)=O
Show InChI InChI=1S/C21H22ClNO6S/c1-15-4-8-19(30(26,27)23(2)10-11-28-3)13-16(15)5-6-17-12-18(22)7-9-20(17)29-14-21(24)25/h4,7-9,12-13H,10-11,14H2,1-3H3,(H,24,25)
Reactome pathway
4.10n/an/an/an/an/an/an/an/a
Merck Serono S.A.
Curated by ChEMBL
Assay Description
Displacement of [3H]PGD2 from human CRTH2 expressed in chinese hamster CHO cells by liquid scintillation counting
J Med Chem 54: 7299-317 (2011)
Article DOI: 10.1021/jm200866y
BindingDB Entry DOI: 10.7270/Q2N58MS1
G protein-coupled receptor 44
(Homo sapiens (Human))
BDBM50356694
(CHEMBL1917609)
Show SMILES COCCN(C)S(=O)(=O)c1ccc(C)c(c1)C#Cc1cc(Cl)ccc1OCC(O)=O
Show InChI InChI=1S/C21H22ClNO6S/c1-15-4-8-19(30(26,27)23(2)10-11-28-3)13-16(15)5-6-17-12-18(22)7-9-20(17)29-14-21(24)25/h4,7-9,12-13H,10-11,14H2,1-3H3,(H,24,25)
Reactome pathway
n/an/a 77n/an/an/an/an/an/a
Merck Serono S.A.
Curated by ChEMBL
Assay Description
Antagonist activity at CRTH2 in human blood cells assessed as inhibition of PGD2-induced eosinophil cell shape change after 10 mins by flow cytometry
J Med Chem 54: 7299-317 (2011)
Article DOI: 10.1021/jm200866y
BindingDB Entry DOI: 10.7270/Q2N58MS1