BDBM50356755 CHEMBL1917575
SMILES: CCCS(=O)(=O)c1cccc(c1)C#Cc1cc(Cl)ccc1OCC(O)=O
InChI Key: InChIKey=STRSTNFXQCOCRS-UHFFFAOYSA-N
Data: 1 KI  1 IC50
Activity Spreadsheet -- Enzyme Inhibition Constant Data from BindingDB
Found 2 hits for monomerid = 50356755
Trg + Lig
Ki
nM
ΔG°
kcal/mole
IC50
nM
Kd
nM
EC50/IC50
nM
koff
s-1
kon
M-1s-1
pHTemp
°C
G protein-coupled receptor 44
(Homo sapiens (Human))
BDBM50356755
(CHEMBL1917575)
Show SMILES CCCS(=O)(=O)c1cccc(c1)C#Cc1cc(Cl)ccc1OCC(O)=O
Show InChI InChI=1S/C19H17ClO5S/c1-2-10-26(23,24)17-5-3-4-14(11-17)6-7-15-12-16(20)8-9-18(15)25-13-19(21)22/h3-5,8-9,11-12H,2,10,13H2,1H3,(H,21,22)
Reactome pathway
9n/an/an/an/an/an/an/an/a
Merck Serono S.A.
Curated by ChEMBL
Assay Description
Displacement of [3H]PGD2 from human CRTH2 expressed in chinese hamster CHO cells by liquid scintillation counting
J Med Chem 54: 7299-317 (2011)
Article DOI: 10.1021/jm200866y
BindingDB Entry DOI: 10.7270/Q2N58MS1
G protein-coupled receptor 44
(Homo sapiens (Human))
BDBM50356755
(CHEMBL1917575)
Show SMILES CCCS(=O)(=O)c1cccc(c1)C#Cc1cc(Cl)ccc1OCC(O)=O
Show InChI InChI=1S/C19H17ClO5S/c1-2-10-26(23,24)17-5-3-4-14(11-17)6-7-15-12-16(20)8-9-18(15)25-13-19(21)22/h3-5,8-9,11-12H,2,10,13H2,1H3,(H,21,22)
Reactome pathway
n/an/a 750n/an/an/an/an/an/a
Merck Serono S.A.
Curated by ChEMBL
Assay Description
Antagonist activity at CRTH2 in human blood cells assessed as inhibition of PGD2-induced eosinophil cell shape change after 10 mins by flow cytometry
J Med Chem 54: 7299-317 (2011)
Article DOI: 10.1021/jm200866y
BindingDB Entry DOI: 10.7270/Q2N58MS1