BDBM50357117 CHEMBL1917432
SMILES: Cc1c(Sc2ccc(Cl)cc2)c2c(cccc2n1CC(O)=O)S(C)(=O)=O
InChI Key: InChIKey=SUEIBJUAZVZPQG-UHFFFAOYSA-N
Data: 1 IC50
Activity Spreadsheet -- Enzyme Inhibition Constant Data from BindingDB
Found 1 hit for monomerid = 50357117
Trg + Lig
Ki
nM
ΔG°
kcal/mole
IC50
nM
Kd
nM
EC50/IC50
nM
koff
s-1
kon
M-1s-1
pHTemp
°C
G protein-coupled receptor 44
(Homo sapiens (Human))
BDBM50357117
(CHEMBL1917432)
Show SMILES Cc1c(Sc2ccc(Cl)cc2)c2c(cccc2n1CC(O)=O)S(C)(=O)=O
Show InChI InChI=1S/C18H16ClNO4S2/c1-11-18(25-13-8-6-12(19)7-9-13)17-14(20(11)10-16(21)22)4-3-5-15(17)26(2,23)24/h3-9H,10H2,1-2H3,(H,21,22)
Reactome pathway
n/an/a 11n/an/an/an/an/an/a
AstraZeneca R&D Charnwood
Curated by ChEMBL
Assay Description
Displacement of [3H]PGD2 from human CRTH2 receptor
Bioorg Med Chem Lett 21: 6288-92 (2011)
Article DOI: 10.1016/j.bmcl.2011.08.124
BindingDB Entry DOI: 10.7270/Q29P3225