BDBM50357119 CHEMBL1917417
SMILES: Cc1c(Sc2ccccc2)c2cc(C)ccc2n1CC(O)=O
InChI Key: InChIKey=PDLCIHCFWCWZDA-UHFFFAOYSA-N
Data: 4 IC50
Activity Spreadsheet -- Enzyme Inhibition Constant Data from BindingDB
Found 4 hits for monomerid = 50357119
Trg + Lig
Ki
nM
ΔG°
kcal/mole
IC50
nM
Kd
nM
EC50/IC50
nM
koff
s-1
kon
M-1s-1
pHTemp
°C
G protein-coupled receptor 44
(Homo sapiens (Human))
BDBM50357119
(CHEMBL1917417)
Show SMILES Cc1c(Sc2ccccc2)c2cc(C)ccc2n1CC(O)=O
Show InChI InChI=1S/C18H17NO2S/c1-12-8-9-16-15(10-12)18(13(2)19(16)11-17(20)21)22-14-6-4-3-5-7-14/h3-10H,11H2,1-2H3,(H,20,21)
Reactome pathway
n/an/a 25n/an/an/an/an/an/a
AstraZeneca R&D Charnwood
Curated by ChEMBL
Assay Description
Antagonist activity at human CRTh2 receptor expressed in HEK cells assessed as inhibition of PGD2-induced calcium flux
Bioorg Med Chem Lett 21: 6288-92 (2011)
Article DOI: 10.1016/j.bmcl.2011.08.124
BindingDB Entry DOI: 10.7270/Q29P3225
Aldose reductase (AR)
(Homo sapiens (Human))
BDBM50357119
(CHEMBL1917417)
Show SMILES Cc1c(Sc2ccccc2)c2cc(C)ccc2n1CC(O)=O
Show InChI InChI=1S/C18H17NO2S/c1-12-8-9-16-15(10-12)18(13(2)19(16)11-17(20)21)22-14-6-4-3-5-7-14/h3-10H,11H2,1-2H3,(H,20,21)
n/an/a 3.16E+3n/an/an/an/an/an/a
AstraZeneca R&D Charnwood
Curated by ChEMBL
Assay Description
Inhibition of human recombinant aldose reductase 1 after 15 mins by spectrophotometry analysis
Bioorg Med Chem Lett 21: 6288-92 (2011)
Article DOI: 10.1016/j.bmcl.2011.08.124
BindingDB Entry DOI: 10.7270/Q29P3225
Aldose reductase
(Rattus norvegicus)
BDBM50357119
(CHEMBL1917417)
Show SMILES Cc1c(Sc2ccccc2)c2cc(C)ccc2n1CC(O)=O
Show InChI InChI=1S/C18H17NO2S/c1-12-8-9-16-15(10-12)18(13(2)19(16)11-17(20)21)22-14-6-4-3-5-7-14/h3-10H,11H2,1-2H3,(H,20,21)
Reactome pathway
n/an/a 157n/an/an/an/an/an/a
AstraZeneca R&D Charnwood
Curated by ChEMBL
Assay Description
Inhibition of rat aldose reductase
Bioorg Med Chem Lett 21: 6288-92 (2011)
Article DOI: 10.1016/j.bmcl.2011.08.124
BindingDB Entry DOI: 10.7270/Q29P3225
G protein-coupled receptor 44
(Homo sapiens (Human))
BDBM50357119
(CHEMBL1917417)
Show SMILES Cc1c(Sc2ccccc2)c2cc(C)ccc2n1CC(O)=O
Show InChI InChI=1S/C18H17NO2S/c1-12-8-9-16-15(10-12)18(13(2)19(16)11-17(20)21)22-14-6-4-3-5-7-14/h3-10H,11H2,1-2H3,(H,20,21)
Reactome pathway
n/an/a 20n/an/an/an/an/an/a
AstraZeneca R&D Charnwood
Curated by ChEMBL
Assay Description
Displacement of [3H]PGD2 from human CRTH2 receptor
Bioorg Med Chem Lett 21: 6288-92 (2011)
Article DOI: 10.1016/j.bmcl.2011.08.124
BindingDB Entry DOI: 10.7270/Q29P3225