BDBM50357126 CHEMBL1917439
SMILES: Cc1c(Sc2ccc(Cl)cc2)c2cc(ccc2n1CC(O)=O)-c1ccccc1
InChI Key: InChIKey=QPZCNPOQSRZYOA-UHFFFAOYSA-N
Data: 2 IC50
Activity Spreadsheet -- Enzyme Inhibition Constant Data from BindingDB
Found 2 hits for monomerid = 50357126
Trg + Lig
Ki
nM
ΔG°
kcal/mole
IC50
nM
Kd
nM
EC50/IC50
nM
koff
s-1
kon
M-1s-1
pHTemp
°C
Aldose reductase (AR)
(Homo sapiens (Human))
BDBM50357126
(CHEMBL1917439)
Show SMILES Cc1c(Sc2ccc(Cl)cc2)c2cc(ccc2n1CC(O)=O)-c1ccccc1
Show InChI InChI=1S/C23H18ClNO2S/c1-15-23(28-19-10-8-18(24)9-11-19)20-13-17(16-5-3-2-4-6-16)7-12-21(20)25(15)14-22(26)27/h2-13H,14H2,1H3,(H,26,27)
n/an/a 1.78E+3n/an/an/an/an/an/a
AstraZeneca R&D Charnwood
Curated by ChEMBL
Assay Description
Inhibition of human recombinant aldose reductase 1 after 15 mins by spectrophotometry analysis
Bioorg Med Chem Lett 21: 6288-92 (2011)
Article DOI: 10.1016/j.bmcl.2011.08.124
BindingDB Entry DOI: 10.7270/Q29P3225
G protein-coupled receptor 44
(Homo sapiens (Human))
BDBM50357126
(CHEMBL1917439)
Show SMILES Cc1c(Sc2ccc(Cl)cc2)c2cc(ccc2n1CC(O)=O)-c1ccccc1
Show InChI InChI=1S/C23H18ClNO2S/c1-15-23(28-19-10-8-18(24)9-11-19)20-13-17(16-5-3-2-4-6-16)7-12-21(20)25(15)14-22(26)27/h2-13H,14H2,1H3,(H,26,27)
Reactome pathway
n/an/a 3.5n/an/an/an/an/an/a
AstraZeneca R&D Charnwood
Curated by ChEMBL
Assay Description
Displacement of [3H]PGD2 from human CRTH2 receptor
Bioorg Med Chem Lett 21: 6288-92 (2011)
Article DOI: 10.1016/j.bmcl.2011.08.124
BindingDB Entry DOI: 10.7270/Q29P3225