BDBM50357130 CHEMBL1917444
SMILES: COc1ccc(Sc2c(C)n(CC(O)=O)c3ccc(C)cc23)cc1
InChI Key: InChIKey=RDWNQKGVOHYXCK-UHFFFAOYSA-N
Data: 2 IC50
Activity Spreadsheet -- Enzyme Inhibition Constant Data from BindingDB
Found 2 hits for monomerid = 50357130
Trg + Lig
Ki
nM
ΔG°
kcal/mole
IC50
nM
Kd
nM
EC50/IC50
nM
koff
s-1
kon
M-1s-1
pHTemp
°C
Aldose reductase (AR)
(Homo sapiens (Human))
BDBM50357130
(CHEMBL1917444)
Show SMILES COc1ccc(Sc2c(C)n(CC(O)=O)c3ccc(C)cc23)cc1
Show InChI InChI=1S/C19H19NO3S/c1-12-4-9-17-16(10-12)19(13(2)20(17)11-18(21)22)24-15-7-5-14(23-3)6-8-15/h4-10H,11H2,1-3H3,(H,21,22)
n/an/a 282n/an/an/an/an/an/a
AstraZeneca R&D Charnwood
Curated by ChEMBL
Assay Description
Inhibition of human recombinant aldose reductase 1 after 15 mins by spectrophotometry analysis
Bioorg Med Chem Lett 21: 6288-92 (2011)
Article DOI: 10.1016/j.bmcl.2011.08.124
BindingDB Entry DOI: 10.7270/Q29P3225
G protein-coupled receptor 44
(Homo sapiens (Human))
BDBM50357130
(CHEMBL1917444)
Show SMILES COc1ccc(Sc2c(C)n(CC(O)=O)c3ccc(C)cc23)cc1
Show InChI InChI=1S/C19H19NO3S/c1-12-4-9-17-16(10-12)19(13(2)20(17)11-18(21)22)24-15-7-5-14(23-3)6-8-15/h4-10H,11H2,1-3H3,(H,21,22)
Reactome pathway
n/an/a 7.10n/an/an/an/an/an/a
AstraZeneca R&D Charnwood
Curated by ChEMBL
Assay Description
Displacement of [3H]PGD2 from human CRTH2 receptor
Bioorg Med Chem Lett 21: 6288-92 (2011)
Article DOI: 10.1016/j.bmcl.2011.08.124
BindingDB Entry DOI: 10.7270/Q29P3225