BDBM50357236 CHEMBL1916490
SMILES: CCCOCCn1c2cc(nnc2c(nc1=O)N1CCN(CC(O)=O)CC1)-c1ccc(OC)nc1
InChI Key: InChIKey=FCDQXDZPKXNOJP-UHFFFAOYSA-N
Data: 1 IC50
Activity Spreadsheet -- Enzyme Inhibition Constant Data from BindingDB
Found 1 hit for monomerid = 50357236
Trg + Lig
Ki
nM
ΔG°
kcal/mole
IC50
nM
Kd
nM
EC50/IC50
nM
koff
s-1
kon
M-1s-1
pHTemp
°C
cGMP-specific 3',5'-cyclic phosphodiesterase
(Homo sapiens (Human))
BDBM50357236
(CHEMBL1916490)
Show SMILES CCCOCCn1c2cc(nnc2c(nc1=O)N1CCN(CC(O)=O)CC1)-c1ccc(OC)nc1
Show InChI InChI=1S/C23H29N7O5/c1-3-11-35-12-10-30-18-13-17(16-4-5-19(34-2)24-14-16)26-27-21(18)22(25-23(30)33)29-8-6-28(7-9-29)15-20(31)32/h4-5,13-14H,3,6-12,15H2,1-2H3,(H,31,32)
Reactome pathway
n/an/a 0.100n/an/an/an/an/an/a
Pfizer Inc.
Curated by ChEMBL
Assay Description
Inhibition of PDE5
Bioorg Med Chem Lett 21: 6348-52 (2011)
Article DOI: 10.1016/j.bmcl.2011.08.106
BindingDB Entry DOI: 10.7270/Q2J67HB0