BDBM50357239 CHEMBL1916487
SMILES: CCCOCCn1c2cc(nnc2c(nc1=O)N1CCC(CC(O)=O)CC1)-c1ccc(OC)nc1
InChI Key: InChIKey=NPWPWSPYRJFQHD-UHFFFAOYSA-N
Data: 1 IC50
Activity Spreadsheet -- Enzyme Inhibition Constant Data from BindingDB
Found 1 hit for monomerid = 50357239
Trg + Lig
Ki
nM
ΔG°
kcal/mole
IC50
nM
Kd
nM
EC50/IC50
nM
koff
s-1
kon
M-1s-1
pHTemp
°C
cGMP-specific 3',5'-cyclic phosphodiesterase
(Homo sapiens (Human))
BDBM50357239
(CHEMBL1916487)
Show SMILES CCCOCCn1c2cc(nnc2c(nc1=O)N1CCC(CC(O)=O)CC1)-c1ccc(OC)nc1
Show InChI InChI=1S/C24H30N6O5/c1-3-11-35-12-10-30-19-14-18(17-4-5-20(34-2)25-15-17)27-28-22(19)23(26-24(30)33)29-8-6-16(7-9-29)13-21(31)32/h4-5,14-16H,3,6-13H2,1-2H3,(H,31,32)
Reactome pathway
n/an/a 0.0400n/an/an/an/an/an/a
Pfizer Inc.
Curated by ChEMBL
Assay Description
Inhibition of PDE5
Bioorg Med Chem Lett 21: 6348-52 (2011)
Article DOI: 10.1016/j.bmcl.2011.08.106
BindingDB Entry DOI: 10.7270/Q2J67HB0