BDBM50357247 CHEMBL1916479
SMILES: COc1ccc(cn1)-c1cc2n(CCOCC(F)(F)F)c(=O)nc(NCC(=O)N(C)C)c2nn1
InChI Key: InChIKey=ZWWZYUASXZMMIK-UHFFFAOYSA-N
Data: 1 IC50
Activity Spreadsheet -- Enzyme Inhibition Constant Data from BindingDB
Found 1 hit for monomerid = 50357247
Trg + Lig
Ki
nM
ΔG°
kcal/mole
IC50
nM
Kd
nM
EC50/IC50
nM
koff
s-1
kon
M-1s-1
pHTemp
°C
cGMP-specific 3',5'-cyclic phosphodiesterase
(Homo sapiens (Human))
BDBM50357247
(CHEMBL1916479)
Show SMILES COc1ccc(cn1)-c1cc2n(CCOCC(F)(F)F)c(=O)nc(NCC(=O)N(C)C)c2nn1
Show InChI InChI=1S/C20H22F3N7O4/c1-29(2)16(31)10-25-18-17-14(30(19(32)26-18)6-7-34-11-20(21,22)23)8-13(27-28-17)12-4-5-15(33-3)24-9-12/h4-5,8-9H,6-7,10-11H2,1-3H3,(H,25,26,32)
Reactome pathway
n/an/a 0.380n/an/an/an/an/an/a
Pfizer Inc.
Curated by ChEMBL
Assay Description
Inhibition of PDE5
Bioorg Med Chem Lett 21: 6348-52 (2011)
Article DOI: 10.1016/j.bmcl.2011.08.106
BindingDB Entry DOI: 10.7270/Q2J67HB0