BDBM50357259 CHEMBL1916298
SMILES: CCCOCCn1c2cc(cnc2c(nc1=O)N1CCN(CCO)CC1)-c1ccc(OC)nc1
InChI Key: InChIKey=OWEKBXGGJZLUPI-UHFFFAOYSA-N
Data: 1 IC50
Activity Spreadsheet -- Enzyme Inhibition Constant Data from BindingDB
Found 1 hit for monomerid = 50357259
Trg + Lig
Ki
nM
ΔG°
kcal/mole
IC50
nM
Kd
nM
EC50/IC50
nM
koff
s-1
kon
M-1s-1
pHTemp
°C
cGMP-specific 3',5'-cyclic phosphodiesterase
(Homo sapiens (Human))
BDBM50357259
(CHEMBL1916298)
Show SMILES CCCOCCn1c2cc(cnc2c(nc1=O)N1CCN(CCO)CC1)-c1ccc(OC)nc1
Show InChI InChI=1S/C24H32N6O4/c1-3-13-34-14-11-30-20-15-19(18-4-5-21(33-2)25-16-18)17-26-22(20)23(27-24(30)32)29-8-6-28(7-9-29)10-12-31/h4-5,15-17,31H,3,6-14H2,1-2H3
Reactome pathway
n/an/a 1.60n/an/an/an/an/an/a
Pfizer Inc.
Curated by ChEMBL
Assay Description
Inhibition of PDE5
Bioorg Med Chem Lett 21: 6348-52 (2011)
Article DOI: 10.1016/j.bmcl.2011.08.106
BindingDB Entry DOI: 10.7270/Q2J67HB0