BDBM50357280 CHEMBL1916517
SMILES: CN(C)CC1CC(=NO1)c1ccc(cc1)[N+]([O-])=O
InChI Key: InChIKey=FUKODXXKPDODID-UHFFFAOYSA-N
Data: 2 IC50
Activity Spreadsheet -- Enzyme Inhibition Constant Data from BindingDB
Found 2 hits for monomerid = 50357280
Trg + Lig
Ki
nM
ΔG°
kcal/mole
IC50
nM
Kd
nM
EC50/IC50
nM
koff
s-1
kon
M-1s-1
pHTemp
°C
DNA (cytosine-5)-methyltransferase 1 (DNMT1)
(Homo sapiens (Human))
BDBM50357280
(CHEMBL1916517)
Show SMILES CN(C)CC1CC(=NO1)c1ccc(cc1)[N+]([O-])=O |c:6|
Show InChI InChI=1S/C12H15N3O3/c1-14(2)8-11-7-12(13-18-11)9-3-5-10(6-4-9)15(16)17/h3-6,11H,7-8H2,1-2H3
n/an/a 1.50E+5n/an/an/an/an/an/a
Universit£ degli Studi di Salerno
Curated by ChEMBL
Assay Description
Inhibition of human recombinant DNMT1 expressed in Sf9 cells assessed as incorporation of [3H]S-adenosyl methionine into hemimethylated oligonucleoti...
J Med Chem 54: 7663-77 (2011)
Article DOI: 10.1021/jm2010404
BindingDB Entry DOI: 10.7270/Q28S4Q98
DNA (cytosine-5)-methyltransferase 1 (DNMT1)
(Homo sapiens (Human))
BDBM50357280
(CHEMBL1916517)
Show SMILES CN(C)CC1CC(=NO1)c1ccc(cc1)[N+]([O-])=O |c:6|
Show InChI InChI=1S/C12H15N3O3/c1-14(2)8-11-7-12(13-18-11)9-3-5-10(6-4-9)15(16)17/h3-6,11H,7-8H2,1-2H3
n/an/a 1.50E+5n/an/an/an/an/an/a
CNRS-Pierre Fabre
Curated by ChEMBL
Assay Description
Inhibition of His6-tagged human recombinant DNMT1 expressed in insect Sf9 cells assessed as reduction in DNA methyltransferase activity using 5'-biot...
J Med Chem 58: 2569-83 (2015)
Article DOI: 10.1021/jm500843d
BindingDB Entry DOI: 10.7270/Q24T6M36