BDBM50357319 CHEMBL1916718
SMILES: CN(C)C\C=C\C(=O)N(C)c1ccc2nc(Nc3ccccc3C)c3cncn3c2c1
InChI Key: InChIKey=IHOAMLDSNGLEGW-JXMROGBWSA-N
Data: 2 IC50
Activity Spreadsheet -- Enzyme Inhibition Constant Data from BindingDB
Found 2 hits for monomerid = 50357319
Trg + Lig
Ki
nM
ΔG°
kcal/mole
IC50
nM
Kd
nM
EC50/IC50
nM
koff
s-1
kon
M-1s-1
pHTemp
°C
Tyrosine-protein kinase Lyn
(Homo sapiens (Human))
BDBM50357319
(CHEMBL1916718)
Show SMILES CN(C)C\C=C\C(=O)N(C)c1ccc2nc(Nc3ccccc3C)c3cncn3c2c1
Show InChI InChI=1S/C24H26N6O/c1-17-8-5-6-9-19(17)26-24-22-15-25-16-30(22)21-14-18(11-12-20(21)27-24)29(4)23(31)10-7-13-28(2)3/h5-12,14-16H,13H2,1-4H3,(H,26,27)/b10-7+
Reactome pathway
n/an/a 623n/an/an/an/an/an/a
Pfizer Inc.
Curated by ChEMBL
Assay Description
Inhibition of LYN-A expressed in Sf9 cells after 60 mins by TR-FRET Assay
Bioorg Med Chem Lett 21: 6258-63 (2011)
Article DOI: 10.1016/j.bmcl.2011.09.008
BindingDB Entry DOI: 10.7270/Q21836XD
Tyrosine-protein kinase BTK
(Homo sapiens (Human))
BDBM50357319
(CHEMBL1916718)
Show SMILES CN(C)C\C=C\C(=O)N(C)c1ccc2nc(Nc3ccccc3C)c3cncn3c2c1
Show InChI InChI=1S/C24H26N6O/c1-17-8-5-6-9-19(17)26-24-22-15-25-16-30(22)21-14-18(11-12-20(21)27-24)29(4)23(31)10-7-13-28(2)3/h5-12,14-16H,13H2,1-4H3,(H,26,27)/b10-7+
NCI pathway
Reactome pathway
n/an/a 3.99n/an/an/an/an/an/a
Pfizer Inc.
Curated by ChEMBL
Assay Description
Inhibition of human full-length BTK expressed in Sf9 cells using FAM-Srctide peptide as substrate after 60 mins by TR-FRET Assay
Bioorg Med Chem Lett 21: 6258-63 (2011)
Article DOI: 10.1016/j.bmcl.2011.09.008
BindingDB Entry DOI: 10.7270/Q21836XD