BDBM50357327 CHEMBL1916885
SMILES: CN(C)C\C=C\C(=O)N(C)c1ccc2nc(Nc3ccc(Cl)cc3C)c3cncn3c2c1
InChI Key: InChIKey=TUXWNBBOYVMMRJ-AATRIKPKSA-N
Data: 2 IC50
Activity Spreadsheet -- Enzyme Inhibition Constant Data from BindingDB
Found 2 hits for monomerid = 50357327
Trg + Lig
Ki
nM
ΔG°
kcal/mole
IC50
nM
Kd
nM
EC50/IC50
nM
koff
s-1
kon
M-1s-1
pHTemp
°C
Tyrosine-protein kinase Lyn
(Homo sapiens (Human))
BDBM50357327
(CHEMBL1916885)
Show SMILES CN(C)C\C=C\C(=O)N(C)c1ccc2nc(Nc3ccc(Cl)cc3C)c3cncn3c2c1
Show InChI InChI=1S/C24H25ClN6O/c1-16-12-17(25)7-9-19(16)27-24-22-14-26-15-31(22)21-13-18(8-10-20(21)28-24)30(4)23(32)6-5-11-29(2)3/h5-10,12-15H,11H2,1-4H3,(H,27,28)/b6-5+
Reactome pathway
n/an/a 378n/an/an/an/an/an/a
Pfizer Inc.
Curated by ChEMBL
Assay Description
Inhibition of LYN-A expressed in Sf9 cells after 60 mins by TR-FRET Assay
Bioorg Med Chem Lett 21: 6258-63 (2011)
Article DOI: 10.1016/j.bmcl.2011.09.008
BindingDB Entry DOI: 10.7270/Q21836XD
Tyrosine-protein kinase BTK
(Homo sapiens (Human))
BDBM50357327
(CHEMBL1916885)
Show SMILES CN(C)C\C=C\C(=O)N(C)c1ccc2nc(Nc3ccc(Cl)cc3C)c3cncn3c2c1
Show InChI InChI=1S/C24H25ClN6O/c1-16-12-17(25)7-9-19(16)27-24-22-14-26-15-31(22)21-13-18(8-10-20(21)28-24)30(4)23(32)6-5-11-29(2)3/h5-10,12-15H,11H2,1-4H3,(H,27,28)/b6-5+
NCI pathway
Reactome pathway
n/an/a 7.56n/an/an/an/an/an/a
Pfizer Inc.
Curated by ChEMBL
Assay Description
Inhibition of human full-length BTK expressed in Sf9 cells using FAM-Srctide peptide as substrate after 60 mins by TR-FRET Assay
Bioorg Med Chem Lett 21: 6258-63 (2011)
Article DOI: 10.1016/j.bmcl.2011.09.008
BindingDB Entry DOI: 10.7270/Q21836XD