BDBM50357346 CHEMBL1916904
SMILES: CNc1ccc2nc(Nc3cc(F)ccc3C)c3cncn3c2c1
InChI Key: InChIKey=LRHOWQSLEKDTCW-UHFFFAOYSA-N
Data: 2 IC50
Activity Spreadsheet -- Enzyme Inhibition Constant Data from BindingDB
Found 2 hits for monomerid = 50357346
Trg + Lig
Ki
nM
ΔG°
kcal/mole
IC50
nM
Kd
nM
EC50/IC50
nM
koff
s-1
kon
M-1s-1
pHTemp
°C
Tyrosine-protein kinase Lyn
(Homo sapiens (Human))
BDBM50357346
(CHEMBL1916904)
Show SMILES CNc1ccc2nc(Nc3cc(F)ccc3C)c3cncn3c2c1
Show InChI InChI=1S/C18H16FN5/c1-11-3-4-12(19)7-15(11)23-18-17-9-21-10-24(17)16-8-13(20-2)5-6-14(16)22-18/h3-10,20H,1-2H3,(H,22,23)
Reactome pathway
n/an/a 40n/an/an/an/an/an/a
Pfizer Inc.
Curated by ChEMBL
Assay Description
Inhibition of LYN-A expressed in Sf9 cells after 60 mins by TR-FRET Assay
Bioorg Med Chem Lett 21: 6258-63 (2011)
Article DOI: 10.1016/j.bmcl.2011.09.008
BindingDB Entry DOI: 10.7270/Q21836XD
Tyrosine-protein kinase BTK
(Homo sapiens (Human))
BDBM50357346
(CHEMBL1916904)
Show SMILES CNc1ccc2nc(Nc3cc(F)ccc3C)c3cncn3c2c1
Show InChI InChI=1S/C18H16FN5/c1-11-3-4-12(19)7-15(11)23-18-17-9-21-10-24(17)16-8-13(20-2)5-6-14(16)22-18/h3-10,20H,1-2H3,(H,22,23)
NCI pathway
Reactome pathway
n/an/a 72n/an/an/an/an/an/a
Pfizer Inc.
Curated by ChEMBL
Assay Description
Inhibition of human full-length BTK expressed in Sf9 cells using FAM-Srctide peptide as substrate after 60 mins by TR-FRET Assay
Bioorg Med Chem Lett 21: 6258-63 (2011)
Article DOI: 10.1016/j.bmcl.2011.09.008
BindingDB Entry DOI: 10.7270/Q21836XD