BDBM50357562 CHEMBL1915402
SMILES: COC(=O)[C@H]1Cc2c(CN1Cc1ccc(O)cc1)[nH]c1ccccc21
InChI Key: InChIKey=UYILNYMOHIDLGB-LJQANCHMSA-N
Data: 1 IC50
Activity Spreadsheet -- Enzyme Inhibition Constant Data from BindingDB
Found 1 hit for monomerid = 50357562
Trg + Lig
Ki
nM
ΔG°
kcal/mole
IC50
nM
Kd
nM
EC50/IC50
nM
koff
s-1
kon
M-1s-1
pHTemp
°C
Nitric Oxide Synthase, inducible
(Mus musculus (mouse))
BDBM50357562
(CHEMBL1915402)
Show SMILES COC(=O)[C@H]1Cc2c(CN1Cc1ccc(O)cc1)[nH]c1ccccc21 |r|
Show InChI InChI=1S/C20H20N2O3/c1-25-20(24)19-10-16-15-4-2-3-5-17(15)21-18(16)12-22(19)11-13-6-8-14(23)9-7-13/h2-9,19,21,23H,10-12H2,1H3/t19-/m1/s1
Reactome pathway
n/an/a 3.75E+4n/an/an/an/an/an/a
University of Hawai'i at Hilo
Curated by ChEMBL
Assay Description
Inhibition of iNOS-mediated nitric oxide production in LPS-stimulated mouse RAW 264.7 cells pretreated 15 mins before LPS challenge measured after 20...
Bioorg Med Chem 19: 6182-95 (2011)
Article DOI: 10.1016/j.bmc.2011.09.020
BindingDB Entry DOI: 10.7270/Q2Z89CTS