BDBM50357634 CHEMBL1915862
SMILES: CN1C[C@@H](COc2cc(C)c(cc2C)C(=O)Nc2cc(ccc2Cl)C(C)(C)C(O)=O)Oc2ccccc12
InChI Key: InChIKey=LOZKTERWUJKZQM-FQEVSTJZSA-N
Data: 1 KI  2 IC50
Activity Spreadsheet -- Enzyme Inhibition Constant Data from BindingDB
Found 3 hits for monomerid = 50357634
Trg + Lig
Ki
nM
ΔG°
kcal/mole
IC50
nM
Kd
nM
EC50/IC50
nM
koff
s-1
kon
M-1s-1
pHTemp
°C
Prostanoid IP receptor
(Homo sapiens (Human))
BDBM50357634
(CHEMBL1915862)
Show SMILES CN1C[C@@H](COc2cc(C)c(cc2C)C(=O)Nc2cc(ccc2Cl)C(C)(C)C(O)=O)Oc2ccccc12 |r|
Show InChI InChI=1S/C29H31ClN2O5/c1-17-13-26(36-16-20-15-32(5)24-8-6-7-9-25(24)37-20)18(2)12-21(17)27(33)31-23-14-19(10-11-22(23)30)29(3,4)28(34)35/h6-14,20H,15-16H2,1-5H3,(H,31,33)(H,34,35)/t20-/m0/s1
NCI pathway
Reactome pathway
3.30E+3n/an/an/an/an/an/an/an/a
Ono Pharmaceutical Co., Ltd
Curated by ChEMBL
Assay Description
Displacement of [3H]Iloprost from human prostanoid IP receptor expressed in CHO cells after 30 mins by liquid scintillation counting
Bioorg Med Chem 19: 6935-48 (2011)
Article DOI: 10.1016/j.bmc.2011.08.065
BindingDB Entry DOI: 10.7270/Q2K35V22
Prostanoid DP receptor
(Homo sapiens (Human))
BDBM50357634
(CHEMBL1915862)
Show SMILES CN1C[C@@H](COc2cc(C)c(cc2C)C(=O)Nc2cc(ccc2Cl)C(C)(C)C(O)=O)Oc2ccccc12 |r|
Show InChI InChI=1S/C29H31ClN2O5/c1-17-13-26(36-16-20-15-32(5)24-8-6-7-9-25(24)37-20)18(2)12-21(17)27(33)31-23-14-19(10-11-22(23)30)29(3,4)28(34)35/h6-14,20H,15-16H2,1-5H3,(H,31,33)(H,34,35)/t20-/m0/s1
n/an/a 32n/an/an/an/an/an/a
Ono Pharmaceutical Co., Ltd
Curated by ChEMBL
Assay Description
Antagonist activity at prostanoid DP receptor in human platelet rich plasma assessed as inhibition of PGD2-induced intracellular cAMP production afte...
Bioorg Med Chem 19: 6935-48 (2011)
Article DOI: 10.1016/j.bmc.2011.08.065
BindingDB Entry DOI: 10.7270/Q2K35V22
Prostanoid DP receptor
(Mus musculus)
BDBM50357634
(CHEMBL1915862)
Show SMILES CN1C[C@@H](COc2cc(C)c(cc2C)C(=O)Nc2cc(ccc2Cl)C(C)(C)C(O)=O)Oc2ccccc12 |r|
Show InChI InChI=1S/C29H31ClN2O5/c1-17-13-26(36-16-20-15-32(5)24-8-6-7-9-25(24)37-20)18(2)12-21(17)27(33)31-23-14-19(10-11-22(23)30)29(3,4)28(34)35/h6-14,20H,15-16H2,1-5H3,(H,31,33)(H,34,35)/t20-/m0/s1
Reactome pathway
n/an/a 43n/an/an/an/an/an/a
Ono Pharmaceutical Co., Ltd
Curated by ChEMBL
Assay Description
Antagonist activity at mouse prostanoid DP receptor expressed in CHO cells assessed as inhibition of PGD2-induced intracellular cAMP production after...
Bioorg Med Chem 19: 6935-48 (2011)
Article DOI: 10.1016/j.bmc.2011.08.065
BindingDB Entry DOI: 10.7270/Q2K35V22