BDBM50357637 CHEMBL1915677
SMILES: CN1C[C@@H](COc2cc(C)c(cc2C)C(=O)Nc2cc(CC(O)=O)ccc2Cl)Oc2ccccc12
InChI Key: InChIKey=SNYPIGRUBSRSAK-IBGZPJMESA-N
Data: 1 KI  1 IC50
Activity Spreadsheet -- Enzyme Inhibition Constant Data from BindingDB
Found 2 hits for monomerid = 50357637
Trg + Lig
Ki
nM
ΔG°
kcal/mole
IC50
nM
Kd
nM
EC50/IC50
nM
koff
s-1
kon
M-1s-1
pHTemp
°C
Prostanoid IP receptor
(Homo sapiens (Human))
BDBM50357637
(CHEMBL1915677)
Show SMILES CN1C[C@@H](COc2cc(C)c(cc2C)C(=O)Nc2cc(CC(O)=O)ccc2Cl)Oc2ccccc12 |r|
Show InChI InChI=1S/C27H27ClN2O5/c1-16-11-25(34-15-19-14-30(3)23-6-4-5-7-24(23)35-19)17(2)10-20(16)27(33)29-22-12-18(13-26(31)32)8-9-21(22)28/h4-12,19H,13-15H2,1-3H3,(H,29,33)(H,31,32)/t19-/m0/s1
NCI pathway
Reactome pathway
1.80E+3n/an/an/an/an/an/an/an/a
Ono Pharmaceutical Co., Ltd
Curated by ChEMBL
Assay Description
Displacement of [3H]Iloprost from human prostanoid IP receptor expressed in CHO cells after 30 mins by liquid scintillation counting
Bioorg Med Chem 19: 6935-48 (2011)
Article DOI: 10.1016/j.bmc.2011.08.065
BindingDB Entry DOI: 10.7270/Q2K35V22
Prostanoid DP receptor
(Mus musculus)
BDBM50357637
(CHEMBL1915677)
Show SMILES CN1C[C@@H](COc2cc(C)c(cc2C)C(=O)Nc2cc(CC(O)=O)ccc2Cl)Oc2ccccc12 |r|
Show InChI InChI=1S/C27H27ClN2O5/c1-16-11-25(34-15-19-14-30(3)23-6-4-5-7-24(23)35-19)17(2)10-20(16)27(33)29-22-12-18(13-26(31)32)8-9-21(22)28/h4-12,19H,13-15H2,1-3H3,(H,29,33)(H,31,32)/t19-/m0/s1
Reactome pathway
n/an/a 5.10n/an/an/an/an/an/a
Ono Pharmaceutical Co., Ltd
Curated by ChEMBL
Assay Description
Antagonist activity at mouse prostanoid DP receptor expressed in CHO cells assessed as inhibition of PGD2-induced intracellular cAMP production after...
Bioorg Med Chem 19: 6935-48 (2011)
Article DOI: 10.1016/j.bmc.2011.08.065
BindingDB Entry DOI: 10.7270/Q2K35V22