BDBM50357641 CHEMBL1914710
SMILES: Fc1ccc(cc1)S(=O)(=O)Nc1cc(cnc1Cl)-c1ccc2ncccc2c1
InChI Key: InChIKey=LBMKYGFVNPHLPV-UHFFFAOYSA-N
Data: 1 KI  1 IC50
Activity Spreadsheet -- Enzyme Inhibition Constant Data from BindingDB
Found 2 hits for monomerid = 50357641
Trg + Lig
Ki
nM
ΔG°
kcal/mole
IC50
nM
Kd
nM
EC50/IC50
nM
koff
s-1
kon
M-1s-1
pHTemp
°C
Phosphatidylinositol 4,5-bisphosphate 3-kinase catalytic subunit alpha isoform
(Homo sapiens (Human))
BDBM50357641
(CHEMBL1914710)
Show SMILES Fc1ccc(cc1)S(=O)(=O)Nc1cc(cnc1Cl)-c1ccc2ncccc2c1
Show InChI InChI=1S/C20H13ClFN3O2S/c21-20-19(25-28(26,27)17-6-4-16(22)5-7-17)11-15(12-24-20)13-3-8-18-14(10-13)2-1-9-23-18/h1-12,25H
NCI pathway
Reactome pathway
2.10n/an/an/an/an/an/an/an/a
Amgen Inc.
Curated by ChEMBL
Assay Description
Inhibition of PI3Kalpha-mediated Akt phosphorylation at Ser 473 in human U87MG cells
J Med Chem 54: 4735-51 (2011)
Article DOI: 10.1021/jm200386s
BindingDB Entry DOI: 10.7270/Q2FB53C5
Phosphatidylinositol 4,5-bisphosphate 3-kinase catalytic subunit alpha isoform
(Homo sapiens (Human))
BDBM50357641
(CHEMBL1914710)
Show SMILES Fc1ccc(cc1)S(=O)(=O)Nc1cc(cnc1Cl)-c1ccc2ncccc2c1
Show InChI InChI=1S/C20H13ClFN3O2S/c21-20-19(25-28(26,27)17-6-4-16(22)5-7-17)11-15(12-24-20)13-3-8-18-14(10-13)2-1-9-23-18/h1-12,25H
NCI pathway
Reactome pathway
n/an/a 377n/an/an/an/an/an/a
Amgen Inc.
Curated by ChEMBL
Assay Description
Inhibition of PI3Kalpha-mediated Akt phosphorylation at Ser 473 in human U87MG cells
J Med Chem 54: 4735-51 (2011)
Article DOI: 10.1021/jm200386s
BindingDB Entry DOI: 10.7270/Q2FB53C5