BDBM50357671 CHEMBL1914735
SMILES: Fc1ccc(cc1)S(=O)(=O)Nc1cc(cnc1Cl)-c1ccc2ncc(NCCN3CCCCC3)nc2c1
InChI Key: InChIKey=GIFGUUZRMKEHAB-UHFFFAOYSA-N
Data: 1 KI  1 IC50
Activity Spreadsheet -- Enzyme Inhibition Constant Data from BindingDB
Found 2 hits for monomerid = 50357671
Trg + Lig
Ki
nM
ΔG°
kcal/mole
IC50
nM
Kd
nM
EC50/IC50
nM
koff
s-1
kon
M-1s-1
pHTemp
°C
Phosphatidylinositol 4,5-bisphosphate 3-kinase catalytic subunit alpha isoform
(Homo sapiens (Human))
BDBM50357671
(CHEMBL1914735)
Show SMILES Fc1ccc(cc1)S(=O)(=O)Nc1cc(cnc1Cl)-c1ccc2ncc(NCCN3CCCCC3)nc2c1
Show InChI InChI=1S/C26H26ClFN6O2S/c27-26-24(33-37(35,36)21-7-5-20(28)6-8-21)15-19(16-31-26)18-4-9-22-23(14-18)32-25(17-30-22)29-10-13-34-11-2-1-3-12-34/h4-9,14-17,33H,1-3,10-13H2,(H,29,32)
NCI pathway
Reactome pathway
3.10n/an/an/an/an/an/an/an/a
Amgen Inc.
Curated by ChEMBL
Assay Description
Inhibition of N-terminus polyHis-tagged human recombinant PI3Kalpha expressed in baculovirus infected insect Sf9 cells using phosphoinositol-4,5-bisp...
J Med Chem 54: 4735-51 (2011)
Article DOI: 10.1021/jm200386s
BindingDB Entry DOI: 10.7270/Q2FB53C5
Phosphatidylinositol 4,5-bisphosphate 3-kinase catalytic subunit alpha isoform
(Homo sapiens (Human))
BDBM50357671
(CHEMBL1914735)
Show SMILES Fc1ccc(cc1)S(=O)(=O)Nc1cc(cnc1Cl)-c1ccc2ncc(NCCN3CCCCC3)nc2c1
Show InChI InChI=1S/C26H26ClFN6O2S/c27-26-24(33-37(35,36)21-7-5-20(28)6-8-21)15-19(16-31-26)18-4-9-22-23(14-18)32-25(17-30-22)29-10-13-34-11-2-1-3-12-34/h4-9,14-17,33H,1-3,10-13H2,(H,29,32)
NCI pathway
Reactome pathway
n/an/a 18n/an/an/an/an/an/a
Amgen Inc.
Curated by ChEMBL
Assay Description
Inhibition of PI3Kalpha-mediated Akt phosphorylation at Ser 473 in human U87MG cells
J Med Chem 54: 4735-51 (2011)
Article DOI: 10.1021/jm200386s
BindingDB Entry DOI: 10.7270/Q2FB53C5