null
SMILES: OC(=O)CCC(=O)n1ccc2cc(ccc12)-c1noc(n1)-c1cc(cc(c1)C(F)(F)F)C(F)(F)F
InChI Key: InChIKey=DWJQOVAMVCWQQA-UHFFFAOYSA-N
Activity Spreadsheet -- Enzyme Inhibition Constant Data from BindingDB
Found 1 hit for monomerid = 50357779
Trg + Lig
Ki
nM
ΔG°
kcal/mole
IC50
nM
Kd
nM
EC50/IC50
nM
koff
s-1
kon
M-1s-1
pHTemp
°C
Sphingosine 1-phosphate receptor 1
(Homo sapiens (Human))
BDBM50357779
(CHEMBL1916557)
Show SMILES OC(=O)CCC(=O)n1ccc2cc(ccc12)-c1noc(n1)-c1cc(cc(c1)C(F)(F)F)C(F)(F)F
Show InChI InChI=1S/C22H13F6N3O4/c23-21(24,25)14-8-13(9-15(10-14)22(26,27)28)20-29-19(30-35-20)12-1-2-16-11(7-12)5-6-31(16)17(32)3-4-18(33)34/h1-2,5-10H,3-4H2,(H,33,34)
Reactome pathway
n/an/an/an/a 41n/an/an/an/a
Arena Pharmaceuticals
Curated by ChEMBL
Assay Description
Agonist activity at human S1P1 receptor expressed in HEK293 cells assessed as inhibition of forskolin-stimulated cAMP production after 1 hr by HTRF a...
Bioorg Med Chem Lett 21: 6013-8 (2011)
Article DOI: 10.1016/j.bmcl.2011.05.110
BindingDB Entry DOI: 10.7270/Q24T6JSB