BDBM50357802 CHEMBL1916579
SMILES: OC(=O)CCC(=O)N1CCc2cc(ccc12)-c1noc(n1)-c1ccc(OC(F)(F)F)cc1
InChI Key: InChIKey=BQGXQGIRXJYUNK-UHFFFAOYSA-N
Data: 1 EC50
Activity Spreadsheet -- Enzyme Inhibition Constant Data from BindingDB
Found 1 hit for monomerid = 50357802
Trg + Lig
Ki
nM
ΔG°
kcal/mole
IC50
nM
Kd
nM
EC50/IC50
nM
koff
s-1
kon
M-1s-1
pHTemp
°C
Sphingosine 1-phosphate receptor 1
(Homo sapiens (Human))
BDBM50357802
(CHEMBL1916579)
Show SMILES OC(=O)CCC(=O)N1CCc2cc(ccc12)-c1noc(n1)-c1ccc(OC(F)(F)F)cc1
Show InChI InChI=1S/C21H16F3N3O5/c22-21(23,24)31-15-4-1-12(2-5-15)20-25-19(26-32-20)14-3-6-16-13(11-14)9-10-27(16)17(28)7-8-18(29)30/h1-6,11H,7-10H2,(H,29,30)
Reactome pathway
n/an/an/an/a 68n/an/an/an/a
Arena Pharmaceuticals
Curated by ChEMBL
Assay Description
Agonist activity at human S1P1 receptor expressed in HEK293 cells assessed as inhibition of forskolin-stimulated cAMP production after 1 hr by HTRF a...
Bioorg Med Chem Lett 21: 6013-8 (2011)
Article DOI: 10.1016/j.bmcl.2011.05.110
BindingDB Entry DOI: 10.7270/Q24T6JSB