BDBM50357806 CHEMBL1915896
SMILES: COc1ccc2nc(C)c3c(C)nc(-c4cccc(c4)C(N)=O)n3c2n1
InChI Key: InChIKey=LPLOWECFLAFSLK-UHFFFAOYSA-N
Data: 11 IC50
Activity Spreadsheet -- Enzyme Inhibition Constant Data from BindingDB
Found 11 hits for monomerid = 50357806
Trg + Lig
Ki
nM
ΔG°
kcal/mole
IC50
nM
Kd
nM
EC50/IC50
nM
koff
s-1
kon
M-1s-1
pHTemp
°C
cGMP-specific 3',5'-cyclic phosphodiesterase
(Homo sapiens (Human))
BDBM50357806
(CHEMBL1915896)
Show SMILES COc1ccc2nc(C)c3c(C)nc(-c4cccc(c4)C(N)=O)n3c2n1
Show InChI InChI=1S/C19H17N5O2/c1-10-16-11(2)22-18(13-6-4-5-12(9-13)17(20)25)24(16)19-14(21-10)7-8-15(23-19)26-3/h4-9H,1-3H3,(H2,20,25)
Reactome pathway
n/an/a 2.08E+3n/an/an/an/an/an/a
Pfizer Inc.
Curated by ChEMBL
Assay Description
Inhibition of recombinant human PDE5A using [3H]cGMP after 1 hr by scintillation proximity assay
J Med Chem 54: 7621-38 (2011)
Article DOI: 10.1021/jm2009138
BindingDB Entry DOI: 10.7270/Q2125T2B
Phosphodiesterase 11A
(Homo sapiens (Human))
BDBM50357806
(CHEMBL1915896)
Show SMILES COc1ccc2nc(C)c3c(C)nc(-c4cccc(c4)C(N)=O)n3c2n1
Show InChI InChI=1S/C19H17N5O2/c1-10-16-11(2)22-18(13-6-4-5-12(9-13)17(20)25)24(16)19-14(21-10)7-8-15(23-19)26-3/h4-9H,1-3H3,(H2,20,25)
n/an/a 2.81E+3n/an/an/an/an/an/a
Pfizer Inc.
Curated by ChEMBL
Assay Description
Inhibition of recombinant human PDE11A using [3H]cAMP after 1 hr by scintillation proximity assay
J Med Chem 54: 7621-38 (2011)
Article DOI: 10.1021/jm2009138
BindingDB Entry DOI: 10.7270/Q2125T2B
cAMP and cAMP-inhibited cGMP 3',5'-cyclic phosphodiesterase 10A
(Homo sapiens (Human))
BDBM50357806
(CHEMBL1915896)
Show SMILES COc1ccc2nc(C)c3c(C)nc(-c4cccc(c4)C(N)=O)n3c2n1
Show InChI InChI=1S/C19H17N5O2/c1-10-16-11(2)22-18(13-6-4-5-12(9-13)17(20)25)24(16)19-14(21-10)7-8-15(23-19)26-3/h4-9H,1-3H3,(H2,20,25)
Reactome pathway
n/an/a 1.80n/an/an/an/an/an/a
Pfizer Inc.
Curated by ChEMBL
Assay Description
Inhibition of N-terminal His-tagged human PDE10A expressed in Escherichia coli using [3H]cAMP after 1 hr by scintillation proximity assay
J Med Chem 54: 7621-38 (2011)
Article DOI: 10.1021/jm2009138
BindingDB Entry DOI: 10.7270/Q2125T2B
Phosphodiesterase 3 (PDE3)
(Homo sapiens (Human))
BDBM50357806
(CHEMBL1915896)
Show SMILES COc1ccc2nc(C)c3c(C)nc(-c4cccc(c4)C(N)=O)n3c2n1
Show InChI InChI=1S/C19H17N5O2/c1-10-16-11(2)22-18(13-6-4-5-12(9-13)17(20)25)24(16)19-14(21-10)7-8-15(23-19)26-3/h4-9H,1-3H3,(H2,20,25)
Reactome pathway
n/an/a>5.00E+3n/an/an/an/an/an/a
Pfizer Inc.
Curated by ChEMBL
Assay Description
Inhibition of recombinant human PDE3A using [3H]cAMP after 1 hr by scintillation proximity assay
J Med Chem 54: 7621-38 (2011)
Article DOI: 10.1021/jm2009138
BindingDB Entry DOI: 10.7270/Q2125T2B
cAMP-specific 3',5'-cyclic phosphodiesterase 4A
(Homo sapiens (Human))
BDBM50357806
(CHEMBL1915896)
Show SMILES COc1ccc2nc(C)c3c(C)nc(-c4cccc(c4)C(N)=O)n3c2n1
Show InChI InChI=1S/C19H17N5O2/c1-10-16-11(2)22-18(13-6-4-5-12(9-13)17(20)25)24(16)19-14(21-10)7-8-15(23-19)26-3/h4-9H,1-3H3,(H2,20,25)
n/an/a>1.00E+4n/an/an/an/an/an/a
Pfizer Inc.
Curated by ChEMBL
Assay Description
Inhibition of recombinant human PDE4A using [3H]cAMP after 1 hr by scintillation proximity assay
J Med Chem 54: 7621-38 (2011)
Article DOI: 10.1021/jm2009138
BindingDB Entry DOI: 10.7270/Q2125T2B
Calcium/calmodulin-dependent 3',5'-cyclic nucleotide phosphodiesterase 1B
(Homo sapiens (Human))
BDBM50357806
(CHEMBL1915896)
Show SMILES COc1ccc2nc(C)c3c(C)nc(-c4cccc(c4)C(N)=O)n3c2n1
Show InChI InChI=1S/C19H17N5O2/c1-10-16-11(2)22-18(13-6-4-5-12(9-13)17(20)25)24(16)19-14(21-10)7-8-15(23-19)26-3/h4-9H,1-3H3,(H2,20,25)
Reactome pathway
n/an/a>1.00E+4n/an/an/an/an/an/a
Pfizer Inc.
Curated by ChEMBL
Assay Description
Inhibition of recombinant human PDE1B using [3H]cAMP after 1 hr by scintillation proximity assay
J Med Chem 54: 7621-38 (2011)
Article DOI: 10.1021/jm2009138
BindingDB Entry DOI: 10.7270/Q2125T2B
Phosphodiesterase 7
(Homo sapiens (Human))
BDBM50357806
(CHEMBL1915896)
Show SMILES COc1ccc2nc(C)c3c(C)nc(-c4cccc(c4)C(N)=O)n3c2n1
Show InChI InChI=1S/C19H17N5O2/c1-10-16-11(2)22-18(13-6-4-5-12(9-13)17(20)25)24(16)19-14(21-10)7-8-15(23-19)26-3/h4-9H,1-3H3,(H2,20,25)
Reactome pathway
n/an/a 2.93E+3n/an/an/an/an/an/a
Pfizer Inc.
Curated by ChEMBL
Assay Description
Inhibition of recombinant human PDE7A using [3H]cAMP after 1 hr by scintillation proximity assay
J Med Chem 54: 7621-38 (2011)
Article DOI: 10.1021/jm2009138
BindingDB Entry DOI: 10.7270/Q2125T2B
Homo sapiens phosphodiesterase 2A (PDE2A)
(Homo sapiens (Human))
BDBM50357806
(CHEMBL1915896)
Show SMILES COc1ccc2nc(C)c3c(C)nc(-c4cccc(c4)C(N)=O)n3c2n1
Show InChI InChI=1S/C19H17N5O2/c1-10-16-11(2)22-18(13-6-4-5-12(9-13)17(20)25)24(16)19-14(21-10)7-8-15(23-19)26-3/h4-9H,1-3H3,(H2,20,25)
n/an/a 37n/an/an/an/an/an/a
Pfizer Inc.
Curated by ChEMBL
Assay Description
Inhibition of recombinant human PDE2A using [3H]cAMP after 1 hr by scintillation proximity assay
J Med Chem 54: 7621-38 (2011)
Article DOI: 10.1021/jm2009138
BindingDB Entry DOI: 10.7270/Q2125T2B
Phosphodiesterase 8
(Homo sapiens (Human))
BDBM50357806
(CHEMBL1915896)
Show SMILES COc1ccc2nc(C)c3c(C)nc(-c4cccc(c4)C(N)=O)n3c2n1
Show InChI InChI=1S/C19H17N5O2/c1-10-16-11(2)22-18(13-6-4-5-12(9-13)17(20)25)24(16)19-14(21-10)7-8-15(23-19)26-3/h4-9H,1-3H3,(H2,20,25)
Reactome pathway
n/an/a>1.00E+4n/an/an/an/an/an/a
Pfizer Inc.
Curated by ChEMBL
Assay Description
Inhibition of recombinant human PDE8A using [3H]cAMP after 1 hr by scintillation proximity assay
J Med Chem 54: 7621-38 (2011)
Article DOI: 10.1021/jm2009138
BindingDB Entry DOI: 10.7270/Q2125T2B
Phosphodiesterase 9A
(Homo sapiens (Human))
BDBM50357806
(CHEMBL1915896)
Show SMILES COc1ccc2nc(C)c3c(C)nc(-c4cccc(c4)C(N)=O)n3c2n1
Show InChI InChI=1S/C19H17N5O2/c1-10-16-11(2)22-18(13-6-4-5-12(9-13)17(20)25)24(16)19-14(21-10)7-8-15(23-19)26-3/h4-9H,1-3H3,(H2,20,25)
n/an/a>1.00E+4n/an/an/an/an/an/a
Pfizer Inc.
Curated by ChEMBL
Assay Description
Inhibition of recombinant human PDE9A using [3H]cGMP after 1 hr by scintillation proximity assay
J Med Chem 54: 7621-38 (2011)
Article DOI: 10.1021/jm2009138
BindingDB Entry DOI: 10.7270/Q2125T2B
Phosphodiesterase 6
(Bos taurus (Bovine))
BDBM50357806
(CHEMBL1915896)
Show SMILES COc1ccc2nc(C)c3c(C)nc(-c4cccc(c4)C(N)=O)n3c2n1
Show InChI InChI=1S/C19H17N5O2/c1-10-16-11(2)22-18(13-6-4-5-12(9-13)17(20)25)24(16)19-14(21-10)7-8-15(23-19)26-3/h4-9H,1-3H3,(H2,20,25)
n/an/a 1.87E+3n/an/an/an/an/an/a
Pfizer Inc.
Curated by ChEMBL
Assay Description
Inhibition of recombinant bovine PDE6A using [3H]cGMP after 1 hr by scintillation proximity assay
J Med Chem 54: 7621-38 (2011)
Article DOI: 10.1021/jm2009138
BindingDB Entry DOI: 10.7270/Q2125T2B