BDBM50357853 CHEMBL1916112
SMILES: COc1cc(F)cc2c1nc(C)c1c(C)nc(-c3cnccc3C)n21
InChI Key: InChIKey=WFSLPYROCMIATC-UHFFFAOYSA-N
Data: 2 IC50
Activity Spreadsheet -- Enzyme Inhibition Constant Data from BindingDB
Found 2 hits for monomerid = 50357853
Trg + Lig
Ki
nM
ΔG°
kcal/mole
IC50
nM
Kd
nM
EC50/IC50
nM
koff
s-1
kon
M-1s-1
pHTemp
°C
Homo sapiens phosphodiesterase 2A (PDE2A)
(Homo sapiens (Human))
BDBM50357853
(CHEMBL1916112)
Show SMILES COc1cc(F)cc2c1nc(C)c1c(C)nc(-c3cnccc3C)n21
Show InChI InChI=1S/C19H17FN4O/c1-10-5-6-21-9-14(10)19-23-12(3)18-11(2)22-17-15(24(18)19)7-13(20)8-16(17)25-4/h5-9H,1-4H3
n/an/a 305n/an/an/an/an/an/a
Pfizer Inc.
Curated by ChEMBL
Assay Description
Inhibition of recombinant human PDE2A using [3H]cAMP after 1 hr by scintillation proximity assay
J Med Chem 54: 7621-38 (2011)
Article DOI: 10.1021/jm2009138
BindingDB Entry DOI: 10.7270/Q2125T2B
cAMP and cAMP-inhibited cGMP 3',5'-cyclic phosphodiesterase 10A
(Homo sapiens (Human))
BDBM50357853
(CHEMBL1916112)
Show SMILES COc1cc(F)cc2c1nc(C)c1c(C)nc(-c3cnccc3C)n21
Show InChI InChI=1S/C19H17FN4O/c1-10-5-6-21-9-14(10)19-23-12(3)18-11(2)22-17-15(24(18)19)7-13(20)8-16(17)25-4/h5-9H,1-4H3
Reactome pathway
n/an/a 2n/an/an/an/an/an/a
Pfizer Inc.
Curated by ChEMBL
Assay Description
Inhibition of N-terminal His-tagged human PDE10A expressed in Escherichia coli using [3H]cAMP after 1 hr by scintillation proximity assay
J Med Chem 54: 7621-38 (2011)
Article DOI: 10.1021/jm2009138
BindingDB Entry DOI: 10.7270/Q2125T2B