BDBM50357905 CHEMBL1916519
SMILES: CC(C)N1CCC(CC1)c1cc(-c2ccc(F)cc2Cl)c2cc[n+]([O-])c(-c3c(Cl)cccc3Cl)c2n1
InChI Key: InChIKey=ODEMNMZLNPEBTF-UHFFFAOYSA-N
Data: 1 IC50
Activity Spreadsheet -- Enzyme Inhibition Constant Data from BindingDB
Found 1 hit for monomerid = 50357905
Trg + Lig
Ki
nM
ΔG°
kcal/mole
IC50
nM
Kd
nM
EC50/IC50
nM
koff
s-1
kon
M-1s-1
pHTemp
°C
Mitogen-activated protein kinase 14
(Homo sapiens (Human))
BDBM50357905
(CHEMBL1916519)
Show SMILES CC(C)N1CCC(CC1)c1cc(-c2ccc(F)cc2Cl)c2cc[n+]([O-])c(-c3c(Cl)cccc3Cl)c2n1 |(32.53,-43.15,;32.54,-41.61,;33.88,-40.85,;31.21,-40.83,;29.87,-41.59,;28.54,-40.82,;28.55,-39.28,;29.88,-38.51,;31.22,-39.29,;27.23,-38.51,;27.23,-36.96,;25.89,-36.19,;25.89,-34.65,;27.23,-33.88,;27.23,-32.35,;25.89,-31.57,;25.89,-30.03,;24.55,-32.35,;24.56,-33.89,;23.23,-34.66,;24.56,-36.96,;23.22,-36.2,;21.89,-36.97,;21.89,-38.51,;20.56,-39.28,;23.22,-39.28,;23.23,-40.82,;21.89,-41.59,;20.56,-40.82,;21.9,-43.13,;23.23,-43.89,;24.57,-43.11,;24.56,-41.58,;25.89,-40.8,;24.55,-38.51,;25.88,-39.28,)|
Show InChI InChI=1S/C28H25Cl3FN3O/c1-16(2)34-11-8-17(9-12-34)25-15-21(19-7-6-18(32)14-24(19)31)20-10-13-35(36)28(27(20)33-25)26-22(29)4-3-5-23(26)30/h3-7,10,13-17H,8-9,11-12H2,1-2H3
NCI pathway
Reactome pathway
n/an/a 0.590n/an/an/an/an/an/a
Rhône-Poulenc Rorer
Curated by ChEMBL
Assay Description
Inhibition of human p38alpha MAP kinase after 1 hr by FRET analysis
J Med Chem 54: 7899-910 (2011)
Article DOI: 10.1021/jm200975u
BindingDB Entry DOI: 10.7270/Q2MW2HKR