BDBM50358141 CHEMBL1923964
SMILES: CC(C)C[C@H](NC(=O)[C@@H](NS(C)(=O)=O)C(C)C)C=O
InChI Key: InChIKey=AWVYTVIGCMPMHI-QWRGUYRKSA-N
Data: 1 IC50
Activity Spreadsheet -- Enzyme Inhibition Constant Data from BindingDB
Found 1 hit for monomerid = 50358141
Trg + Lig
Ki
nM
ΔG°
kcal/mole
IC50
nM
Kd
nM
EC50/IC50
nM
koff
s-1
kon
M-1s-1
pHTemp
°C
Calpain 1
(Rattus norvegicus)
BDBM50358141
(CHEMBL1923964)
Show SMILES CC(C)C[C@H](NC(=O)[C@@H](NS(C)(=O)=O)C(C)C)C=O |r|
Show InChI InChI=1S/C12H24N2O4S/c1-8(2)6-10(7-15)13-12(16)11(9(3)4)14-19(5,17)18/h7-11,14H,6H2,1-5H3,(H,13,16)/t10-,11-/m0/s1
n/an/a 830n/an/an/an/an/an/a
University of Canterbury
Curated by ChEMBL
Assay Description
Inhibition of rat CAPN1 using BODIPY-labeled casein substrate by fluorometric analysis
J Med Chem 54: 7503-22 (2011)
Article DOI: 10.1021/jm200471r
BindingDB Entry DOI: 10.7270/Q2F47PJ4