BDBM50358145 CHEMBL1923968
SMILES: CC(C)C[C@H](NC(=O)[C@H](NS(=O)(=O)c1ccc(F)cc1)C(C)C)C=O
InChI Key: InChIKey=WSJWUIDLGZAXID-GOEBONIOSA-N
Data: 2 IC50
Activity Spreadsheet -- Enzyme Inhibition Constant Data from BindingDB
Found 2 hits for monomerid = 50358145
Trg + Lig
Ki
nM
ΔG°
kcal/mole
IC50
nM
Kd
nM
EC50/IC50
nM
koff
s-1
kon
M-1s-1
pHTemp
°C
Calpain1
(Homo sapiens (Human))
BDBM50358145
(CHEMBL1923968)
Show SMILES CC(C)C[C@H](NC(=O)[C@H](NS(=O)(=O)c1ccc(F)cc1)C(C)C)C=O |r|
Show InChI InChI=1S/C17H25FN2O4S/c1-11(2)9-14(10-21)19-17(22)16(12(3)4)20-25(23,24)15-7-5-13(18)6-8-15/h5-8,10-12,14,16,20H,9H2,1-4H3,(H,19,22)/t14-,16+/m0/s1
Reactome pathway
n/an/a 1.40E+4n/an/an/an/an/an/a
Senju Pharmaceutical Co.
Curated by ChEMBL
Assay Description
In vitro inhibition of porcine mu-calpain.
J Med Chem 46: 868-71 (2003)
Article DOI: 10.1021/jm0201924
BindingDB Entry DOI: 10.7270/Q2TB168Z
Calpain 1
(Rattus norvegicus)
BDBM50358145
(CHEMBL1923968)
Show SMILES CC(C)C[C@H](NC(=O)[C@H](NS(=O)(=O)c1ccc(F)cc1)C(C)C)C=O |r|
Show InChI InChI=1S/C17H25FN2O4S/c1-11(2)9-14(10-21)19-17(22)16(12(3)4)20-25(23,24)15-7-5-13(18)6-8-15/h5-8,10-12,14,16,20H,9H2,1-4H3,(H,19,22)/t14-,16+/m0/s1
n/an/a 4.20E+4n/an/an/an/an/an/a
University of Canterbury
Curated by ChEMBL
Assay Description
Inhibition of rat CAPN1 using BODIPY-labeled casein substrate by fluorometric analysis
J Med Chem 54: 7503-22 (2011)
Article DOI: 10.1021/jm200471r
BindingDB Entry DOI: 10.7270/Q2F47PJ4