BDBM50358150 CHEMBL1921827
SMILES: CC(C)C[C@@H]1NC(=O)[C@H](Cc2ccc(OCCC[C@H](NC1=O)C=O)cc2)NC(=O)OCc1ccccc1
InChI Key: InChIKey=XHFUTOGUXWEPFS-HVCNVCAESA-N
Data: 1 IC50
Activity Spreadsheet -- Enzyme Inhibition Constant Data from BindingDB
Found 1 hit for monomerid = 50358150
Trg + Lig
Ki
nM
ΔG°
kcal/mole
IC50
nM
Kd
nM
EC50/IC50
nM
koff
s-1
kon
M-1s-1
pHTemp
°C
Calpain-2 (m-Calpain)
(Homo sapiens (Human))
BDBM50358150
(CHEMBL1921827)
Show SMILES CC(C)C[C@@H]1NC(=O)[C@H](Cc2ccc(OCCC[C@H](NC1=O)C=O)cc2)NC(=O)OCc1ccccc1 |r|
Show InChI InChI=1S/C28H35N3O6/c1-19(2)15-24-26(33)29-22(17-32)9-6-14-36-23-12-10-20(11-13-23)16-25(27(34)30-24)31-28(35)37-18-21-7-4-3-5-8-21/h3-5,7-8,10-13,17,19,22,24-25H,6,9,14-16,18H2,1-2H3,(H,29,33)(H,30,34)(H,31,35)/t22-,24-,25-/m0/s1
n/an/a 850n/an/an/an/an/an/a
University of Canterbury
Curated by ChEMBL
Assay Description
Inhibition of CAPN2 using BODIPY-labeled casein substrate by fluorometric analysis
J Med Chem 54: 7503-22 (2011)
Article DOI: 10.1021/jm200471r
BindingDB Entry DOI: 10.7270/Q2F47PJ4