BDBM50358181 CHEMBL1921853
SMILES: O=C(Nc1ccc(cc1)N1S(=O)(=O)c2ccccc2S1(=O)=O)c1ccccc1
InChI Key: InChIKey=MZQDBGVUOJXXNI-UHFFFAOYSA-N
Data: 1 EC50
Activity Spreadsheet -- Enzyme Inhibition Constant Data from BindingDB
Found 1 hit for monomerid = 50358181
Trg + Lig
Ki
nM
ΔG°
kcal/mole
IC50
nM
Kd
nM
EC50/IC50
nM
koff
s-1
kon
M-1s-1
pHTemp
°C
Metabotropic glutamate receptor 4 (mGluR4)
(Homo sapiens (Human))
BDBM50358181
(CHEMBL1921853)
Show SMILES O=C(Nc1ccc(cc1)N1S(=O)(=O)c2ccccc2S1(=O)=O)c1ccccc1
Show InChI InChI=1S/C19H14N2O5S2/c22-19(14-6-2-1-3-7-14)20-15-10-12-16(13-11-15)21-27(23,24)17-8-4-5-9-18(17)28(21,25)26/h1-13H,(H,20,22)
n/an/an/an/a 402n/an/an/an/a
Vanderbilt University Medical Center
Curated by ChEMBL
Assay Description
Positive allosteric modulator activity at human mGlu4 receptor expressed in CHO cells expressing Gqi5 by calcium mobilization assay
J Med Chem 54: 7639-47 (2011)
Article DOI: 10.1021/jm200956q
BindingDB Entry DOI: 10.7270/Q25Q4WHD